BDBM50388008 CHEMBL2058426
SMILES: C\N=C1/N(C)C(=O)\C(=C/c2c[nH]c3cccc(Br)c23)N1C
InChI Key: InChIKey=ORMRVPRSUUACQQ-ZLJHMRGVSA-N
Data: 1 KI  2 IC50
Activity Spreadsheet -- Enzyme Inhibition Constant Data from BindingDB
Found 3 hits for monomerid = 50388008
Trg + Lig
Ki
nM
ΔG°
kcal/mole
IC50
nM
Kd
nM
EC50/IC50
nM
koff
s-1
kon
M-1s-1
pHTemp
°C
5-hydroxytryptamine receptor 3A
(Homo sapiens (Human))
BDBM50388008
(CHEMBL2058426)
Show SMILES C\N=C1/N(C)C(=O)\C(=C/c2c[nH]c3cccc(Br)c23)N1C
Show InChI InChI=1S/C15H15BrN4O/c1-17-15-19(2)12(14(21)20(15)3)7-9-8-18-11-6-4-5-10(16)13(9)11/h4-8,18H,1-3H3/b12-7+,17-15-
Reactome pathway
591n/an/an/an/an/an/an/an/a
University of Mississippi
Curated by ChEMBL
Assay Description
Displacement of [3H]GR65630 from human recombinant 5HT3 receptor expressed in HEKT cells
Bioorg Med Chem 21: 7083-90 (2013)
Article DOI: 10.1016/j.bmc.2013.09.011
BindingDB Entry DOI: 10.7270/Q2RJ4KXM
Amine oxidase (flavin-containing) A
(Homo sapiens (Human))
BDBM50388008
(CHEMBL2058426)
Show SMILES C\N=C1/N(C)C(=O)\C(=C/c2c[nH]c3cccc(Br)c23)N1C
Show InChI InChI=1S/C15H15BrN4O/c1-17-15-19(2)12(14(21)20(15)3)7-9-8-18-11-6-4-5-10(16)13(9)11/h4-8,18H,1-3H3/b12-7+,17-15-
n/an/a 623n/an/an/an/an/an/a
University of Mississippi
Curated by ChEMBL
Assay Description
Inhibition of human recombinant MAO-A using kynuramine as substrate preincubated with compound for 15 mins measured after 20 mins by fluorometric ana...
Bioorg Med Chem Lett 22: 4926-9 (2012)
Article DOI: 10.1016/j.bmcl.2012.06.058
BindingDB Entry DOI: 10.7270/Q21Z45GF
Amine oxidase [flavin-containing] B
(Homo sapiens (Human))
BDBM50388008
(CHEMBL2058426)
Show SMILES C\N=C1/N(C)C(=O)\C(=C/c2c[nH]c3cccc(Br)c23)N1C
Show InChI InChI=1S/C15H15BrN4O/c1-17-15-19(2)12(14(21)20(15)3)7-9-8-18-11-6-4-5-10(16)13(9)11/h4-8,18H,1-3H3/b12-7+,17-15-
n/an/a 5.22E+3n/an/an/an/an/an/a
University of Mississippi
Curated by ChEMBL
Assay Description
Inhibition of human recombinant MAO-B using kynuramine as substrate preincubated with compound for 15 mins measured after 20 mins by fluorometric ana...
Bioorg Med Chem Lett 22: 4926-9 (2012)
Article DOI: 10.1016/j.bmcl.2012.06.058
BindingDB Entry DOI: 10.7270/Q21Z45GF