BDBM50388280 CHEMBL2058234
SMILES: COc1ccc(CC[C@@H](OC(=O)[C@@H]2CCCCN2S(=O)(=O)c2cc(Cl)cc(Cl)c2)c2cccc(OCC(O)=O)c2)cc1OC
InChI Key: InChIKey=AOMAGJKZRYWVSR-RRPNLBNLSA-N
Data: 1 KI  3 IC50
Activity Spreadsheet -- Enzyme Inhibition Constant Data from BindingDB
Found 4 hits for monomerid = 50388280
Trg + Lig
Ki
nM
ΔG°
kcal/mole
IC50
nM
Kd
nM
EC50/IC50
nM
koff
s-1
kon
M-1s-1
pHTemp
°C
Peptidyl-prolyl cis-trans isomerase FKBP5
(Homo sapiens (Human))
BDBM50388280
(CHEMBL2058234)
Show SMILES COc1ccc(CC[C@@H](OC(=O)[C@@H]2CCCCN2S(=O)(=O)c2cc(Cl)cc(Cl)c2)c2cccc(OCC(O)=O)c2)cc1OC |r|
Show InChI InChI=1S/C31H33Cl2NO9S/c1-40-28-12-10-20(14-29(28)41-2)9-11-27(21-6-5-7-24(15-21)42-19-30(35)36)43-31(37)26-8-3-4-13-34(26)44(38,39)25-17-22(32)16-23(33)18-25/h5-7,10,12,14-18,26-27H,3-4,8-9,11,13,19H2,1-2H3,(H,35,36)/t26-,27+/m0/s1
1.38E+4n/an/an/an/an/an/an/an/a
Max Institute of Psychiatry
Curated by ChEMBL
Assay Description
Binding affinity to human FKBP51 by competitive fluorescence polarization assay
J Med Chem 56: 3922-35 (2013)
Article DOI: 10.1021/jm400087k
BindingDB Entry DOI: 10.7270/Q2QZ2CC1
FK506 binding protein 4
(Homo sapiens (Human))
BDBM50388280
(CHEMBL2058234)
Show SMILES COc1ccc(CC[C@@H](OC(=O)[C@@H]2CCCCN2S(=O)(=O)c2cc(Cl)cc(Cl)c2)c2cccc(OCC(O)=O)c2)cc1OC |r|
Show InChI InChI=1S/C31H33Cl2NO9S/c1-40-28-12-10-20(14-29(28)41-2)9-11-27(21-6-5-7-24(15-21)42-19-30(35)36)43-31(37)26-8-3-4-13-34(26)44(38,39)25-17-22(32)16-23(33)18-25/h5-7,10,12,14-18,26-27H,3-4,8-9,11,13,19H2,1-2H3,(H,35,36)/t26-,27+/m0/s1
NCI pathway
Reactome pathway
n/an/a 1.43E+4n/an/an/an/an/an/a
Max Planck Institute of Psychiatry
Curated by ChEMBL
Assay Description
Binding affinity to FKBP52 FK1 domain by competitive fluorescence polarization assay
J Med Chem 55: 4123-31 (2012)
Article DOI: 10.1021/jm201747c
BindingDB Entry DOI: 10.7270/Q2QJ7JCV
Peptidyl-prolyl cis-trans isomerase FKBP1A
(Homo sapiens (Human))
BDBM50388280
(CHEMBL2058234)
Show SMILES COc1ccc(CC[C@@H](OC(=O)[C@@H]2CCCCN2S(=O)(=O)c2cc(Cl)cc(Cl)c2)c2cccc(OCC(O)=O)c2)cc1OC |r|
Show InChI InChI=1S/C31H33Cl2NO9S/c1-40-28-12-10-20(14-29(28)41-2)9-11-27(21-6-5-7-24(15-21)42-19-30(35)36)43-31(37)26-8-3-4-13-34(26)44(38,39)25-17-22(32)16-23(33)18-25/h5-7,10,12,14-18,26-27H,3-4,8-9,11,13,19H2,1-2H3,(H,35,36)/t26-,27+/m0/s1
NCI pathway
Reactome pathway
n/an/a 800n/an/an/an/an/an/a
Max Planck Institute of Psychiatry
Curated by ChEMBL
Assay Description
Binding affinity to FKBP12 by competitive fluorescence polarization assay
J Med Chem 55: 4123-31 (2012)
Article DOI: 10.1021/jm201747c
BindingDB Entry DOI: 10.7270/Q2QJ7JCV
Peptidyl-prolyl cis-trans isomerase FKBP5
(Homo sapiens (Human))
BDBM50388280
(CHEMBL2058234)
Show SMILES COc1ccc(CC[C@@H](OC(=O)[C@@H]2CCCCN2S(=O)(=O)c2cc(Cl)cc(Cl)c2)c2cccc(OCC(O)=O)c2)cc1OC |r|
Show InChI InChI=1S/C31H33Cl2NO9S/c1-40-28-12-10-20(14-29(28)41-2)9-11-27(21-6-5-7-24(15-21)42-19-30(35)36)43-31(37)26-8-3-4-13-34(26)44(38,39)25-17-22(32)16-23(33)18-25/h5-7,10,12,14-18,26-27H,3-4,8-9,11,13,19H2,1-2H3,(H,35,36)/t26-,27+/m0/s1
n/an/a 2.26E+4n/an/an/an/an/an/a
Max Planck Institute of Psychiatry
Curated by ChEMBL
Assay Description
Binding affinity to FKBP51 FK1 domain by competitive fluorescence polarization assay
J Med Chem 55: 4123-31 (2012)
Article DOI: 10.1021/jm201747c
BindingDB Entry DOI: 10.7270/Q2QJ7JCV