BDBM50388290 CHEMBL2058496
SMILES: COc1ccc(CC[C@@H](OC(=O)[C@@H]2CCCCN2S(=O)(=O)c2cc(Cl)c(NC(C)=O)c(Cl)c2)c2cccc(OCC(O)=O)c2)cc1OC
InChI Key: InChIKey=CSKDOWWZNUPFPY-WUFINQPMSA-N
Data: 3 IC50
Activity Spreadsheet -- Enzyme Inhibition Constant Data from BindingDB
Found 3 hits for monomerid = 50388290
Trg + Lig
Ki
nM
ΔG°
kcal/mole
IC50
nM
Kd
nM
EC50/IC50
nM
koff
s-1
kon
M-1s-1
pHTemp
°C
Peptidyl-prolyl cis-trans isomerase FKBP5
(Homo sapiens (Human))
BDBM50388290
(CHEMBL2058496)
Show SMILES COc1ccc(CC[C@@H](OC(=O)[C@@H]2CCCCN2S(=O)(=O)c2cc(Cl)c(NC(C)=O)c(Cl)c2)c2cccc(OCC(O)=O)c2)cc1OC |r|
Show InChI InChI=1S/C33H36Cl2N2O10S/c1-20(38)36-32-25(34)17-24(18-26(32)35)48(42,43)37-14-5-4-9-27(37)33(41)47-28(22-7-6-8-23(16-22)46-19-31(39)40)12-10-21-11-13-29(44-2)30(15-21)45-3/h6-8,11,13,15-18,27-28H,4-5,9-10,12,14,19H2,1-3H3,(H,36,38)(H,39,40)/t27-,28+/m0/s1
n/an/a 1.61E+4n/an/an/an/an/an/a
Max Planck Institute of Psychiatry
Curated by ChEMBL
Assay Description
Binding affinity to FKBP51 FK1 domain by competitive fluorescence polarization assay
J Med Chem 55: 4123-31 (2012)
Article DOI: 10.1021/jm201747c
BindingDB Entry DOI: 10.7270/Q2QJ7JCV
Peptidyl-prolyl cis-trans isomerase FKBP1A
(Homo sapiens (Human))
BDBM50388290
(CHEMBL2058496)
Show SMILES COc1ccc(CC[C@@H](OC(=O)[C@@H]2CCCCN2S(=O)(=O)c2cc(Cl)c(NC(C)=O)c(Cl)c2)c2cccc(OCC(O)=O)c2)cc1OC |r|
Show InChI InChI=1S/C33H36Cl2N2O10S/c1-20(38)36-32-25(34)17-24(18-26(32)35)48(42,43)37-14-5-4-9-27(37)33(41)47-28(22-7-6-8-23(16-22)46-19-31(39)40)12-10-21-11-13-29(44-2)30(15-21)45-3/h6-8,11,13,15-18,27-28H,4-5,9-10,12,14,19H2,1-3H3,(H,36,38)(H,39,40)/t27-,28+/m0/s1
NCI pathway
Reactome pathway
n/an/a 1.18E+3n/an/an/an/an/an/a
Max Planck Institute of Psychiatry
Curated by ChEMBL
Assay Description
Binding affinity to FKBP12 by competitive fluorescence polarization assay
J Med Chem 55: 4123-31 (2012)
Article DOI: 10.1021/jm201747c
BindingDB Entry DOI: 10.7270/Q2QJ7JCV
FK506 binding protein 4
(Homo sapiens (Human))
BDBM50388290
(CHEMBL2058496)
Show SMILES COc1ccc(CC[C@@H](OC(=O)[C@@H]2CCCCN2S(=O)(=O)c2cc(Cl)c(NC(C)=O)c(Cl)c2)c2cccc(OCC(O)=O)c2)cc1OC |r|
Show InChI InChI=1S/C33H36Cl2N2O10S/c1-20(38)36-32-25(34)17-24(18-26(32)35)48(42,43)37-14-5-4-9-27(37)33(41)47-28(22-7-6-8-23(16-22)46-19-31(39)40)12-10-21-11-13-29(44-2)30(15-21)45-3/h6-8,11,13,15-18,27-28H,4-5,9-10,12,14,19H2,1-3H3,(H,36,38)(H,39,40)/t27-,28+/m0/s1
NCI pathway
Reactome pathway
n/an/a 2.05E+4n/an/an/an/an/an/a
Max Planck Institute of Psychiatry
Curated by ChEMBL
Assay Description
Binding affinity to FKBP52 FK1 domain by competitive fluorescence polarization assay
J Med Chem 55: 4123-31 (2012)
Article DOI: 10.1021/jm201747c
BindingDB Entry DOI: 10.7270/Q2QJ7JCV