BDBM50388547 CHEMBL1181663::CHEMBL187863
SMILES: NCCCCn1c2-c3ccccc3C(=O)c2c2ccccc2c1=O
InChI Key: InChIKey=PRJMRKZHNPXCMW-UHFFFAOYSA-N
Data: 2 IC50  1 EC50
Activity Spreadsheet -- Enzyme Inhibition Constant Data from BindingDB
Found 3 hits for monomerid = 50388547
Trg + Lig
Ki
nM
ΔG°
kcal/mole
IC50
nM
Kd
nM
EC50/IC50
nM
koff
s-1
kon
M-1s-1
pHTemp
°C
Retinoic acid receptor RXR-alpha
(Homo sapiens (Human))
BDBM50388547
(CHEMBL1181663 | CHEMBL187863)
Show SMILES NCCCCn1c2-c3ccccc3C(=O)c2c2ccccc2c1=O
Show InChI InChI=1S/C20H18N2O2/c21-11-5-6-12-22-18-14-8-2-3-9-15(14)19(23)17(18)13-7-1-4-10-16(13)20(22)24/h1-4,7-10H,5-6,11-12,21H2
NCI pathway
Reactome pathway
n/an/an/an/a 1.13E+4n/an/an/an/a
Purdue University
Curated by ChEMBL
Assay Description
Activation of human RXRalpha activity expressed in COS1 cells after 12 hrs by RXRE-luciferase reporter gene assay
J Med Chem 56: 2581-605 (2013)
Article DOI: 10.1021/jm400026k
BindingDB Entry DOI: 10.7270/Q2G44RNG
Tyrosyl-DNA phosphodiesterase 1 (TDP1)
(Homo sapiens (Human))
BDBM50388547
(CHEMBL1181663 | CHEMBL187863)
Show SMILES NCCCCn1c2-c3ccccc3C(=O)c2c2ccccc2c1=O
Show InChI InChI=1S/C20H18N2O2/c21-11-5-6-12-22-18-14-8-2-3-9-15(14)19(23)17(18)13-7-1-4-10-16(13)20(22)24/h1-4,7-10H,5-6,11-12,21H2
n/an/a 2.34E+4n/an/an/an/an/an/a
Purdue University
Curated by ChEMBL
Assay Description
Inhibition of human Tdp1 in Tdp1-deficient chicken DT40 whole cell extract using 5'-[32P]-labeled single-stranded DNA oligonucleotide containing 3'-p...
J Med Chem 55: 4457-78 (2012)
Article DOI: 10.1021/jm300335n
BindingDB Entry DOI: 10.7270/Q2SB46TZ
Tyrosyl-DNA phosphodiesterase 1 (TDP1)
(Homo sapiens (Human))
BDBM50388547
(CHEMBL1181663 | CHEMBL187863)
Show SMILES NCCCCn1c2-c3ccccc3C(=O)c2c2ccccc2c1=O
Show InChI InChI=1S/C20H18N2O2/c21-11-5-6-12-22-18-14-8-2-3-9-15(14)19(23)17(18)13-7-1-4-10-16(13)20(22)24/h1-4,7-10H,5-6,11-12,21H2
n/an/a 2.23E+4n/an/an/an/an/an/a
Purdue University
Curated by ChEMBL
Assay Description
Inhibition of human recombinant Tdp1 using 5'-[32P]-labeled single-stranded DNA oligonucleotide containing 3'-phosphotyrosine as substrate assessed a...
J Med Chem 55: 4457-78 (2012)
Article DOI: 10.1021/jm300335n
BindingDB Entry DOI: 10.7270/Q2SB46TZ