BDBM50388812 CHEMBL2062707
SMILES: CCCCCCCCCCCCCCCC(NCc1ccc(O)cc1)=C1C(=O)OC(CO)C1=O
InChI Key: InChIKey=MNNMCDOZYMPKIW-UHFFFAOYSA-N
Data: 7 IC50
Activity Spreadsheet -- Enzyme Inhibition Constant Data from BindingDB
Found 7 hits for monomerid = 50388812
Trg + Lig
Ki
nM
ΔG°
kcal/mole
IC50
nM
Kd
nM
EC50/IC50
nM
koff
s-1
kon
M-1s-1
pHTemp
°C
Dual Specificity Protein Phosphatase 1
(Homo sapiens (Human))
BDBM50388812
(CHEMBL2062707)
Show SMILES CCCCCCCCCCCCCCCC(NCc1ccc(O)cc1)=C1C(=O)OC(CO)C1=O |w:15.15|
Show InChI InChI=1S/C28H43NO5/c1-2-3-4-5-6-7-8-9-10-11-12-13-14-15-24(26-27(32)25(21-30)34-28(26)33)29-20-22-16-18-23(31)19-17-22/h16-19,25,29-31H,2-15,20-21H2,1H3
NCI pathway
n/an/a>1.00E+5n/an/an/an/an/an/a
TBA
Curated by ChEMBL
Assay Description
Inhibition of MKP1
ACS Med Chem Lett 3: 294-298 (2012)
Article DOI: 10.1021/ml2002778
BindingDB Entry DOI: 10.7270/Q2ZW1N0H
Dual specificity protein phosphatase 6
(Homo sapiens (Human))
BDBM50388812
(CHEMBL2062707)
Show SMILES CCCCCCCCCCCCCCCC(NCc1ccc(O)cc1)=C1C(=O)OC(CO)C1=O |w:15.15|
Show InChI InChI=1S/C28H43NO5/c1-2-3-4-5-6-7-8-9-10-11-12-13-14-15-24(26-27(32)25(21-30)34-28(26)33)29-20-22-16-18-23(31)19-17-22/h16-19,25,29-31H,2-15,20-21H2,1H3
Reactome pathway
n/an/a>1.00E+5n/an/an/an/an/an/a
TBA
Curated by ChEMBL
Assay Description
Inhibition of MKP3
ACS Med Chem Lett 3: 294-298 (2012)
Article DOI: 10.1021/ml2002778
BindingDB Entry DOI: 10.7270/Q2ZW1N0H
phosphatase Cdc25
(Homo sapiens (Human))
BDBM50388812
(CHEMBL2062707)
Show SMILES CCCCCCCCCCCCCCCC(NCc1ccc(O)cc1)=C1C(=O)OC(CO)C1=O |w:15.15|
Show InChI InChI=1S/C28H43NO5/c1-2-3-4-5-6-7-8-9-10-11-12-13-14-15-24(26-27(32)25(21-30)34-28(26)33)29-20-22-16-18-23(31)19-17-22/h16-19,25,29-31H,2-15,20-21H2,1H3
Reactome pathway
n/an/a 6.86E+3n/an/an/an/an/an/a
TBA
Curated by ChEMBL
Assay Description
Inhibition of CDC25A
ACS Med Chem Lett 3: 294-298 (2012)
Article DOI: 10.1021/ml2002778
BindingDB Entry DOI: 10.7270/Q2ZW1N0H
Protein-tyrosine phosphatase 1B
(Homo sapiens (Human))
BDBM50388812
(CHEMBL2062707)
Show SMILES CCCCCCCCCCCCCCCC(NCc1ccc(O)cc1)=C1C(=O)OC(CO)C1=O |w:15.15|
Show InChI InChI=1S/C28H43NO5/c1-2-3-4-5-6-7-8-9-10-11-12-13-14-15-24(26-27(32)25(21-30)34-28(26)33)29-20-22-16-18-23(31)19-17-22/h16-19,25,29-31H,2-15,20-21H2,1H3
NCI pathway
Reactome pathway
n/an/a 6.81E+4n/an/an/an/an/an/a
TBA
Curated by ChEMBL
Assay Description
Inhibition of PTP1B
ACS Med Chem Lett 3: 294-298 (2012)
Article DOI: 10.1021/ml2002778
BindingDB Entry DOI: 10.7270/Q2ZW1N0H
Cdc25C
(Homo sapiens (Human))
BDBM50388812
(CHEMBL2062707)
Show SMILES CCCCCCCCCCCCCCCC(NCc1ccc(O)cc1)=C1C(=O)OC(CO)C1=O |w:15.15|
Show InChI InChI=1S/C28H43NO5/c1-2-3-4-5-6-7-8-9-10-11-12-13-14-15-24(26-27(32)25(21-30)34-28(26)33)29-20-22-16-18-23(31)19-17-22/h16-19,25,29-31H,2-15,20-21H2,1H3
n/an/a 4.41E+4n/an/an/an/an/an/a
TBA
Curated by ChEMBL
Assay Description
Inhibition of CDC25C
ACS Med Chem Lett 3: 294-298 (2012)
Article DOI: 10.1021/ml2002778
BindingDB Entry DOI: 10.7270/Q2ZW1N0H
Dual specificity protein phosphatase (VHR)
(Homo sapiens (Human))
BDBM50388812
(CHEMBL2062707)
Show SMILES CCCCCCCCCCCCCCCC(NCc1ccc(O)cc1)=C1C(=O)OC(CO)C1=O |w:15.15|
Show InChI InChI=1S/C28H43NO5/c1-2-3-4-5-6-7-8-9-10-11-12-13-14-15-24(26-27(32)25(21-30)34-28(26)33)29-20-22-16-18-23(31)19-17-22/h16-19,25,29-31H,2-15,20-21H2,1H3
Reactome pathway
n/an/a 9.93E+3n/an/an/an/an/an/a
TBA
Curated by ChEMBL
Assay Description
Inhibition of VHR
ACS Med Chem Lett 3: 294-298 (2012)
Article DOI: 10.1021/ml2002778
BindingDB Entry DOI: 10.7270/Q2ZW1N0H
Dual specificity phosphatase Cdc25B
(Homo sapiens (Human))
BDBM50388812
(CHEMBL2062707)
Show SMILES CCCCCCCCCCCCCCCC(NCc1ccc(O)cc1)=C1C(=O)OC(CO)C1=O |w:15.15|
Show InChI InChI=1S/C28H43NO5/c1-2-3-4-5-6-7-8-9-10-11-12-13-14-15-24(26-27(32)25(21-30)34-28(26)33)29-20-22-16-18-23(31)19-17-22/h16-19,25,29-31H,2-15,20-21H2,1H3
Reactome pathway
n/an/a 4.23E+3n/an/an/an/an/an/a
TBA
Curated by ChEMBL
Assay Description
Inhibition of CDC25B
ACS Med Chem Lett 3: 294-298 (2012)
Article DOI: 10.1021/ml2002778
BindingDB Entry DOI: 10.7270/Q2ZW1N0H