BDBM50389231 CHEMBL2063321
SMILES: CN1CCN(CC1)c1ccc(cc1)C(=O)Nc1cc(n[nH]1)-c1ccc(CNC(=O)Oc2ccccc2)cc1
InChI Key: InChIKey=VQWQMCSERGTZMF-UHFFFAOYSA-N
Data: 4 IC50
Activity Spreadsheet -- Enzyme Inhibition Constant Data from BindingDB
Found 4 hits for monomerid = 50389231
Trg + Lig
Ki
nM
ΔG°
kcal/mole
IC50
nM
Kd
nM
EC50/IC50
nM
koff
s-1
kon
M-1s-1
pHTemp
°C
Aurora kinase A
(Homo sapiens (Human))
BDBM50389231
(CHEMBL2063321)
Show SMILES CN1CCN(CC1)c1ccc(cc1)C(=O)Nc1cc(n[nH]1)-c1ccc(CNC(=O)Oc2ccccc2)cc1
Show InChI InChI=1S/C29H30N6O3/c1-34-15-17-35(18-16-34)24-13-11-23(12-14-24)28(36)31-27-19-26(32-33-27)22-9-7-21(8-10-22)20-30-29(37)38-25-5-3-2-4-6-25/h2-14,19H,15-18,20H2,1H3,(H,30,37)(H2,31,32,33,36)
NCI pathway
Reactome pathway
n/an/a>1.00E+3n/an/an/an/an/an/a
National Health Research Institutes
Curated by ChEMBL
Assay Description
Inhibition of Aurora A
Bioorg Med Chem Lett 22: 4654-9 (2012)
Article DOI: 10.1016/j.bmcl.2012.05.116
BindingDB Entry DOI: 10.7270/Q2XS5WGV
Vascular endothelial growth factor receptor 2
(Homo sapiens (Human))
BDBM50389231
(CHEMBL2063321)
Show SMILES CN1CCN(CC1)c1ccc(cc1)C(=O)Nc1cc(n[nH]1)-c1ccc(CNC(=O)Oc2ccccc2)cc1
Show InChI InChI=1S/C29H30N6O3/c1-34-15-17-35(18-16-34)24-13-11-23(12-14-24)28(36)31-27-19-26(32-33-27)22-9-7-21(8-10-22)20-30-29(37)38-25-5-3-2-4-6-25/h2-14,19H,15-18,20H2,1H3,(H,30,37)(H2,31,32,33,36)
NCI pathway
Reactome pathway
n/an/a 92n/an/an/an/an/an/a
National Health Research Institutes
Curated by ChEMBL
Assay Description
Inhibition of VEGFR2
Bioorg Med Chem Lett 22: 4654-9 (2012)
Article DOI: 10.1016/j.bmcl.2012.05.116
BindingDB Entry DOI: 10.7270/Q2XS5WGV
Vascular endothelial growth factor receptor 1
(Homo sapiens (Human))
BDBM50389231
(CHEMBL2063321)
Show SMILES CN1CCN(CC1)c1ccc(cc1)C(=O)Nc1cc(n[nH]1)-c1ccc(CNC(=O)Oc2ccccc2)cc1
Show InChI InChI=1S/C29H30N6O3/c1-34-15-17-35(18-16-34)24-13-11-23(12-14-24)28(36)31-27-19-26(32-33-27)22-9-7-21(8-10-22)20-30-29(37)38-25-5-3-2-4-6-25/h2-14,19H,15-18,20H2,1H3,(H,30,37)(H2,31,32,33,36)
n/an/a 54n/an/an/an/an/an/a
National Health Research Institutes
Curated by ChEMBL
Assay Description
Inhibition of VEGFR1
Bioorg Med Chem Lett 22: 4654-9 (2012)
Article DOI: 10.1016/j.bmcl.2012.05.116
BindingDB Entry DOI: 10.7270/Q2XS5WGV
Receptor-type tyrosine-protein kinase FLT3
(Homo sapiens (Human))
BDBM50389231
(CHEMBL2063321)
Show SMILES CN1CCN(CC1)c1ccc(cc1)C(=O)Nc1cc(n[nH]1)-c1ccc(CNC(=O)Oc2ccccc2)cc1
Show InChI InChI=1S/C29H30N6O3/c1-34-15-17-35(18-16-34)24-13-11-23(12-14-24)28(36)31-27-19-26(32-33-27)22-9-7-21(8-10-22)20-30-29(37)38-25-5-3-2-4-6-25/h2-14,19H,15-18,20H2,1H3,(H,30,37)(H2,31,32,33,36)
n/an/a 16n/an/an/an/an/an/a
National Health Research Institutes
Curated by ChEMBL
Assay Description
Inhibition of wild type FLT3
Bioorg Med Chem Lett 22: 4654-9 (2012)
Article DOI: 10.1016/j.bmcl.2012.05.116
BindingDB Entry DOI: 10.7270/Q2XS5WGV