BDBM50389260 CHEMBL1986658
SMILES: Nc1nsc2cccc(C(=O)Nc3cccc(CNC(=O)Nc4cccc(F)c4)c3)c12
InChI Key: InChIKey=ZQXHCYUUGYPWJB-UHFFFAOYSA-N
Data: 2 IC50
Activity Spreadsheet -- Enzyme Inhibition Constant Data from BindingDB
Found 2 hits for monomerid = 50389260
Trg + Lig
Ki
nM
ΔG°
kcal/mole
IC50
nM
Kd
nM
EC50/IC50
nM
koff
s-1
kon
M-1s-1
pHTemp
°C
Aurora kinase A
(Homo sapiens (Human))
BDBM50389260
(CHEMBL1986658)
Show SMILES Nc1nsc2cccc(C(=O)Nc3cccc(CNC(=O)Nc4cccc(F)c4)c3)c12
Show InChI InChI=1S/C22H18FN5O2S/c23-14-5-2-7-16(11-14)27-22(30)25-12-13-4-1-6-15(10-13)26-21(29)17-8-3-9-18-19(17)20(24)28-31-18/h1-11H,12H2,(H2,24,28)(H,26,29)(H2,25,27,30)
NCI pathway
Reactome pathway
n/an/a 1.25E+4n/an/an/an/an/an/a
Abbott Laboratories
Curated by ChEMBL
Assay Description
Inhibition of Aurora A kinase by HTRF analysis in presence of 1 mM ATP
Bioorg Med Chem Lett 22: 4528-31 (2012)
Article DOI: 10.1016/j.bmcl.2012.05.125
BindingDB Entry DOI: 10.7270/Q2T154RT
Aurora kinase B
(Homo sapiens (Human))
BDBM50389260
(CHEMBL1986658)
Show SMILES Nc1nsc2cccc(C(=O)Nc3cccc(CNC(=O)Nc4cccc(F)c4)c3)c12
Show InChI InChI=1S/C22H18FN5O2S/c23-14-5-2-7-16(11-14)27-22(30)25-12-13-4-1-6-15(10-13)26-21(29)17-8-3-9-18-19(17)20(24)28-31-18/h1-11H,12H2,(H2,24,28)(H,26,29)(H2,25,27,30)
Reactome pathway
n/an/a 50n/an/an/an/an/an/a
Abbott Laboratories
Curated by ChEMBL
Assay Description
Inhibition of Aurora B kinase by HTRF analysis in presence of 1 mM ATP
Bioorg Med Chem Lett 22: 4528-31 (2012)
Article DOI: 10.1016/j.bmcl.2012.05.125
BindingDB Entry DOI: 10.7270/Q2T154RT