BDBM50389285 CHEMBL2063759
SMILES: CCNC(=O)Nc1ccc(cc1)-c1nc2CCS(=O)(=O)Cc2c(n1)N1C[C@@H]2CC[C@H](C1)O2
InChI Key: InChIKey=LZDMNDUELOWCFW-UHFFFAOYSA-N
Data: 2 KI  1 IC50
Activity Spreadsheet -- Enzyme Inhibition Constant Data from BindingDB
Found 3 hits for monomerid = 50389285
Trg + Lig
Ki
nM
ΔG°
kcal/mole
IC50
nM
Kd
nM
EC50/IC50
nM
koff
s-1
kon
M-1s-1
pHTemp
°C
Serine/threonine-protein kinase mTOR
(Homo sapiens (Human))
BDBM50389285
(CHEMBL2063759)
Show SMILES CCNC(=O)Nc1ccc(cc1)-c1nc2CCS(=O)(=O)Cc2c(n1)N1C[C@@H]2CC[C@H](C1)O2 |r|
Show InChI InChI=1S/C22H27N5O4S/c1-2-23-22(28)24-15-5-3-14(4-6-15)20-25-19-9-10-32(29,30)13-18(19)21(26-20)27-11-16-7-8-17(12-27)31-16/h3-6,16-17H,2,7-13H2,1H3,(H2,23,24,28)
NCI pathway
Reactome pathway
5n/an/an/an/an/an/an/an/a
Pfizer Inc.
Curated by ChEMBL
Assay Description
Inhibition of mTOR
Bioorg Med Chem Lett 22: 5114-7 (2012)
Article DOI: 10.1016/j.bmcl.2012.05.104
BindingDB Entry DOI: 10.7270/Q29024WG
Phosphatidylinositol 4,5-bisphosphate 3-kinase catalytic subunit alpha isoform
(Homo sapiens (Human))
BDBM50389285
(CHEMBL2063759)
Show SMILES CCNC(=O)Nc1ccc(cc1)-c1nc2CCS(=O)(=O)Cc2c(n1)N1C[C@@H]2CC[C@H](C1)O2 |r|
Show InChI InChI=1S/C22H27N5O4S/c1-2-23-22(28)24-15-5-3-14(4-6-15)20-25-19-9-10-32(29,30)13-18(19)21(26-20)27-11-16-7-8-17(12-27)31-16/h3-6,16-17H,2,7-13H2,1H3,(H2,23,24,28)
NCI pathway
Reactome pathway
3.00E+3n/an/an/an/an/an/an/an/a
Pfizer Inc.
Curated by ChEMBL
Assay Description
Inhibition of PI3Kalpha
Bioorg Med Chem Lett 22: 5114-7 (2012)
Article DOI: 10.1016/j.bmcl.2012.05.104
BindingDB Entry DOI: 10.7270/Q29024WG
Serine/threonine-protein kinase mTOR
(Homo sapiens (Human))
BDBM50389285
(CHEMBL2063759)
Show SMILES CCNC(=O)Nc1ccc(cc1)-c1nc2CCS(=O)(=O)Cc2c(n1)N1C[C@@H]2CC[C@H](C1)O2 |r|
Show InChI InChI=1S/C22H27N5O4S/c1-2-23-22(28)24-15-5-3-14(4-6-15)20-25-19-9-10-32(29,30)13-18(19)21(26-20)27-11-16-7-8-17(12-27)31-16/h3-6,16-17H,2,7-13H2,1H3,(H2,23,24,28)
NCI pathway
Reactome pathway
n/an/a 55n/an/an/an/an/an/a
Pfizer Inc.
Curated by ChEMBL
Assay Description
Inhibition of mTOR-mediated AKT phosphorylation at Ser473 by cell based assay
Bioorg Med Chem Lett 22: 5114-7 (2012)
Article DOI: 10.1016/j.bmcl.2012.05.104
BindingDB Entry DOI: 10.7270/Q29024WG