BDBM50389476 CHEMBL2063036
SMILES: OB(O)[C@@H]1C[C@@H](O)CN1C(=O)[C@@H]1C[C@@H](O)CN1
InChI Key: InChIKey=YQHVRHHVEWIRMK-NGJRWZKOSA-N
Data: 3 IC50
Activity Spreadsheet -- Enzyme Inhibition Constant Data from BindingDB
Found 3 hits for monomerid = 50389476
Trg + Lig
Ki
nM
ΔG°
kcal/mole
IC50
nM
Kd
nM
EC50/IC50
nM
koff
s-1
kon
M-1s-1
pHTemp
°C
Dipeptidyl peptidase 4
(Homo sapiens (Human))
BDBM50389476
(CHEMBL2063036)
Show SMILES OB(O)[C@@H]1C[C@@H](O)CN1C(=O)[C@@H]1C[C@@H](O)CN1 |r|
Show InChI InChI=1S/C9H17BN2O5/c13-5-1-7(11-3-5)9(15)12-4-6(14)2-8(12)10(16)17/h5-8,11,13-14,16-17H,1-4H2/t5-,6-,7+,8+/m1/s1
Reactome pathway
n/an/a 48n/an/an/an/an/an/a
Tufts University School of Medicine
Curated by ChEMBL
Assay Description
Inhibition of human DPP4 expressed in HEK293 cells using Ala-Pro-p-nitroanilide hydrochloride salt as substrate preincubated for 10 mins prior to add...
Bioorg Med Chem Lett 22: 5536-40 (2012)
Article DOI: 10.1016/j.bmcl.2012.07.033
BindingDB Entry DOI: 10.7270/Q2M909QF
Dipeptidyl peptidase 9
(Homo sapiens (Human))
BDBM50389476
(CHEMBL2063036)
Show SMILES OB(O)[C@@H]1C[C@@H](O)CN1C(=O)[C@@H]1C[C@@H](O)CN1 |r|
Show InChI InChI=1S/C9H17BN2O5/c13-5-1-7(11-3-5)9(15)12-4-6(14)2-8(12)10(16)17/h5-8,11,13-14,16-17H,1-4H2/t5-,6-,7+,8+/m1/s1
n/an/a 200n/an/an/an/an/an/a
Tufts University School of Medicine
Curated by ChEMBL
Assay Description
Inhibition of human DPP9 expressed in HEK293 cells using Ala-Pro-p-nitroanilide hydrochloride salt as substrate preincubated for 10 mins prior to add...
Bioorg Med Chem Lett 22: 5536-40 (2012)
Article DOI: 10.1016/j.bmcl.2012.07.033
BindingDB Entry DOI: 10.7270/Q2M909QF
Dipeptidyl peptidase VIII
(Homo sapiens (Human))
BDBM50389476
(CHEMBL2063036)
Show SMILES OB(O)[C@@H]1C[C@@H](O)CN1C(=O)[C@@H]1C[C@@H](O)CN1 |r|
Show InChI InChI=1S/C9H17BN2O5/c13-5-1-7(11-3-5)9(15)12-4-6(14)2-8(12)10(16)17/h5-8,11,13-14,16-17H,1-4H2/t5-,6-,7+,8+/m1/s1
n/an/a 500n/an/an/an/an/an/a
Tufts University School of Medicine
Curated by ChEMBL
Assay Description
Inhibition of human DPP8 expressed in HEK293 cells using Ala-Pro-p-nitroanilide hydrochloride salt as substrate preincubated for 10 mins prior to add...
Bioorg Med Chem Lett 22: 5536-40 (2012)
Article DOI: 10.1016/j.bmcl.2012.07.033
BindingDB Entry DOI: 10.7270/Q2M909QF