BDBM50389945 CHEMBL2071074
SMILES: CNc1ccc(CCNC(=O)c2cc3cc(Cl)ccc3[nH]2)cc1
InChI Key: InChIKey=UWFGRWQWQQPOFQ-UHFFFAOYSA-N
Data: 2 IC50
Activity Spreadsheet -- Enzyme Inhibition Constant Data from BindingDB
Found 2 hits for monomerid = 50389945
Trg + Lig
Ki
nM
ΔG°
kcal/mole
IC50
nM
Kd
nM
EC50/IC50
nM
koff
s-1
kon
M-1s-1
pHTemp
°C
Cannabinoid receptor 2
(Homo sapiens (Human))
BDBM50389945
(CHEMBL2071074)
Show SMILES CNc1ccc(CCNC(=O)c2cc3cc(Cl)ccc3[nH]2)cc1
Show InChI InChI=1S/C18H18ClN3O/c1-20-15-5-2-12(3-6-15)8-9-21-18(23)17-11-13-10-14(19)4-7-16(13)22-17/h2-7,10-11,20,22H,8-9H2,1H3,(H,21,23)
Reactome pathway
n/an/a>1.00E+4n/an/an/an/an/an/a
Sapienza Universit£ di Roma
Curated by ChEMBL
Assay Description
Allosteric modulation of human recombinant CB2 receptor expressed in HEK293 cells assessed as inhibition of [3H]CP55940 binding
J Med Chem 55: 5627-31 (2012)
Article DOI: 10.1021/jm201485c
BindingDB Entry DOI: 10.7270/Q27W6D8K
Cannabinoid receptor 1
(Homo sapiens (Human))
BDBM50389945
(CHEMBL2071074)
Show SMILES CNc1ccc(CCNC(=O)c2cc3cc(Cl)ccc3[nH]2)cc1
Show InChI InChI=1S/C18H18ClN3O/c1-20-15-5-2-12(3-6-15)8-9-21-18(23)17-11-13-10-14(19)4-7-16(13)22-17/h2-7,10-11,20,22H,8-9H2,1H3,(H,21,23)
NCI pathway
Reactome pathway
n/an/a>1.00E+4n/an/an/an/an/an/a
Sapienza Universit£ di Roma
Curated by ChEMBL
Assay Description
Allosteric modulation of human recombinant CB1 receptor expressed in HEK293 cells assessed as inhibition of [3H]CP55940 binding
J Med Chem 55: 5627-31 (2012)
Article DOI: 10.1021/jm201485c
BindingDB Entry DOI: 10.7270/Q27W6D8K