BDBM50390076 CHEMBL2069403
SMILES: CN1CCN(CC1)c1cccc2OC[C@H](Cc12)NC(=O)c1nn(nc1C)-c1ccccc1
InChI Key: InChIKey=WHEVXUDXFKTGQS-SFHVURJKSA-N
Data: 3 IC50
Activity Spreadsheet -- Enzyme Inhibition Constant Data from BindingDB
Found 3 hits for monomerid = 50390076
Trg + Lig
Ki
nM
ΔG°
kcal/mole
IC50
nM
Kd
nM
EC50/IC50
nM
koff
s-1
kon
M-1s-1
pHTemp
°C
Sodium channel protein type 9 subunit alpha
(Homo sapiens (Human))
BDBM50390076
(CHEMBL2069403)
Show SMILES CN1CCN(CC1)c1cccc2OC[C@H](Cc12)NC(=O)c1nn(nc1C)-c1ccccc1 |r|
Show InChI InChI=1S/C24H28N6O2/c1-17-23(27-30(26-17)19-7-4-3-5-8-19)24(31)25-18-15-20-21(9-6-10-22(20)32-16-18)29-13-11-28(2)12-14-29/h3-10,18H,11-16H2,1-2H3,(H,25,31)/t18-/m0/s1
n/an/a 316n/an/an/an/an/an/a
AstraZeneca
Curated by ChEMBL
Assay Description
Inhibition of human NaV1.7 expressed in HEK293 cells by whole-cell voltage clamp assay
Bioorg Med Chem Lett 22: 5618-24 (2012)
Article DOI: 10.1016/j.bmcl.2012.06.105
BindingDB Entry DOI: 10.7270/Q2ZC83ZX
Potassium voltage-gated channel subfamily H member 2
(Homo sapiens (Human))
BDBM50390076
(CHEMBL2069403)
Show SMILES CN1CCN(CC1)c1cccc2OC[C@H](Cc12)NC(=O)c1nn(nc1C)-c1ccccc1 |r|
Show InChI InChI=1S/C24H28N6O2/c1-17-23(27-30(26-17)19-7-4-3-5-8-19)24(31)25-18-15-20-21(9-6-10-22(20)32-16-18)29-13-11-28(2)12-14-29/h3-10,18H,11-16H2,1-2H3,(H,25,31)/t18-/m0/s1
Reactome pathway
n/an/a 7.94E+3n/an/an/an/an/an/a
AstraZeneca
Curated by ChEMBL
Assay Description
Inhibition of human ERG expressed in CHO cells by IonWorks HT assay
Bioorg Med Chem Lett 22: 5618-24 (2012)
Article DOI: 10.1016/j.bmcl.2012.06.105
BindingDB Entry DOI: 10.7270/Q2ZC83ZX
Sodium channel protein type 5 subunit alpha
(Homo sapiens (Human))
BDBM50390076
(CHEMBL2069403)
Show SMILES CN1CCN(CC1)c1cccc2OC[C@H](Cc12)NC(=O)c1nn(nc1C)-c1ccccc1 |r|
Show InChI InChI=1S/C24H28N6O2/c1-17-23(27-30(26-17)19-7-4-3-5-8-19)24(31)25-18-15-20-21(9-6-10-22(20)32-16-18)29-13-11-28(2)12-14-29/h3-10,18H,11-16H2,1-2H3,(H,25,31)/t18-/m0/s1
n/an/a 5.01E+3n/an/an/an/an/an/a
AstraZeneca
Curated by ChEMBL
Assay Description
Inhibition of human NaV1.5 expressed in CHO cells by IonWorks assay
Bioorg Med Chem Lett 22: 5618-24 (2012)
Article DOI: 10.1016/j.bmcl.2012.06.105
BindingDB Entry DOI: 10.7270/Q2ZC83ZX