BDBM50390373 CHEMBL2070914
SMILES: Nc1nc(nc2n(CC3OCCc4ccccc34)nnc12)C1CC1
InChI Key: InChIKey=WXDJSDQPUGQRLB-UHFFFAOYSA-N
Data: 1 IC50
Activity Spreadsheet -- Enzyme Inhibition Constant Data from BindingDB
Found 1 hit for monomerid = 50390373
Trg + Lig
Ki
nM
ΔG°
kcal/mole
IC50
nM
Kd
nM
EC50/IC50
nM
koff
s-1
kon
M-1s-1
pHTemp
°C
Phosphodiesterase 8
(Homo sapiens (Human))
BDBM50390373
(CHEMBL2070914)
Show SMILES Nc1nc(nc2n(CC3OCCc4ccccc34)nnc12)C1CC1
Show InChI InChI=1S/C17H18N6O/c18-15-14-17(20-16(19-15)11-5-6-11)23(22-21-14)9-13-12-4-2-1-3-10(12)7-8-24-13/h1-4,11,13H,5-9H2,(H2,18,19,20)
Reactome pathway
n/an/a 3.63n/an/an/an/an/an/a
Pfizer Inc.
Curated by ChEMBL
Assay Description
Inhibition of PDE8B expressed in Sf9 insect cells
Bioorg Med Chem Lett 22: 5721-6 (2012)
Article DOI: 10.1016/j.bmcl.2012.06.079
BindingDB Entry DOI: 10.7270/Q2J67J0X