BDBM50390709 CHEMBL2070318
SMILES: Cc1[nH]c2ncccc2c1C1CCN(C1)C(=O)C(C)(C)c1ccc(Cl)cc1
InChI Key: InChIKey=MVTLFHFSFGMNSR-UHFFFAOYSA-N
Data: 1 IC50
Activity Spreadsheet -- Enzyme Inhibition Constant Data from BindingDB
Found 1 hit for monomerid = 50390709
Trg + Lig
Ki
nM
ΔG°
kcal/mole
IC50
nM
Kd
nM
EC50/IC50
nM
koff
s-1
kon
M-1s-1
pHTemp
°C
11-beta-hydroxysteroid dehydrogenase 1
(Homo sapiens (Human))
BDBM50390709
(CHEMBL2070318)
Show SMILES Cc1[nH]c2ncccc2c1C1CCN(C1)C(=O)C(C)(C)c1ccc(Cl)cc1
Show InChI InChI=1S/C22H24ClN3O/c1-14-19(18-5-4-11-24-20(18)25-14)15-10-12-26(13-15)21(27)22(2,3)16-6-8-17(23)9-7-16/h4-9,11,15H,10,12-13H2,1-3H3,(H,24,25)
Reactome pathway
n/an/a 12n/an/an/an/an/an/a
Merck-Serono S.A.
Curated by ChEMBL
Assay Description
Inhibition of human recombinant 11beta-HSD1 expressed in Escherichia coli assessed as conversion of cortisone to cortisol level after 150 mins by HTR...
Bioorg Med Chem Lett 22: 5909-14 (2012)
Article DOI: 10.1016/j.bmcl.2012.07.070
BindingDB Entry DOI: 10.7270/Q2Z89DH5