BDBM50390922 CHEMBL2070954
SMILES: CCCc1ccc(cc1)S(=O)(=O)N1CCCC[C@@H]1C(=O)Nc1nc(cs1)-c1ccc(OC)cc1
InChI Key: InChIKey=XJYFAQRRMUXSRE-HSZRJFAPSA-N
Data: 1 EC50
Activity Spreadsheet -- Enzyme Inhibition Constant Data from BindingDB
Found 1 hit for monomerid = 50390922
Trg + Lig
Ki
nM
ΔG°
kcal/mole
IC50
nM
Kd
nM
EC50/IC50
nM
koff
s-1
kon
M-1s-1
pHTemp
°C
KCNQ (Kv7) potassium channel
(Homo sapiens (Human))
BDBM50390922
(CHEMBL2070954)
Show SMILES CCCc1ccc(cc1)S(=O)(=O)N1CCCC[C@@H]1C(=O)Nc1nc(cs1)-c1ccc(OC)cc1 |r|
Show InChI InChI=1S/C25H29N3O4S2/c1-3-6-18-8-14-21(15-9-18)34(30,31)28-16-5-4-7-23(28)24(29)27-25-26-22(17-33-25)19-10-12-20(32-2)13-11-19/h8-15,17,23H,3-7,16H2,1-2H3,(H,26,27,29)/t23-/m1/s1
Reactome pathway
n/an/an/an/a 700n/an/an/an/a
Vanderbilt University Medical Center
Curated by ChEMBL
Assay Description
Activation of Kv7.1 channel expressed in CHO cells assessed as depolarization-induced thallium influx after 3 mins by patch clamp assay
Bioorg Med Chem Lett 22: 5936-41 (2012)
Article DOI: 10.1016/j.bmcl.2012.07.060
BindingDB Entry DOI: 10.7270/Q25T3MKN