BDBM50390926 CHEMBL2070981
SMILES: COc1ccc(cc1)-c1csc(NC(=O)[C@H]2CCCCN2C(=O)c2cccc(F)c2)n1
InChI Key: InChIKey=RHADGVIDFAHDIJ-HXUWFJFHSA-N
Data: 1 EC50
Activity Spreadsheet -- Enzyme Inhibition Constant Data from BindingDB
Found 1 hit for monomerid = 50390926
Trg + Lig
Ki
nM
ΔG°
kcal/mole
IC50
nM
Kd
nM
EC50/IC50
nM
koff
s-1
kon
M-1s-1
pHTemp
°C
KCNQ (Kv7) potassium channel
(Homo sapiens (Human))
BDBM50390926
(CHEMBL2070981)
Show SMILES COc1ccc(cc1)-c1csc(NC(=O)[C@H]2CCCCN2C(=O)c2cccc(F)c2)n1 |r|
Show InChI InChI=1S/C23H22FN3O3S/c1-30-18-10-8-15(9-11-18)19-14-31-23(25-19)26-21(28)20-7-2-3-12-27(20)22(29)16-5-4-6-17(24)13-16/h4-6,8-11,13-14,20H,2-3,7,12H2,1H3,(H,25,26,28)/t20-/m1/s1
Reactome pathway
n/an/an/an/a 6.13E+3n/an/an/an/a
Vanderbilt University Medical Center
Curated by ChEMBL
Assay Description
Activation of Kv7.1 channel expressed in CHO cells assessed as depolarization-induced thallium influx after 3 mins by patch clamp assay
Bioorg Med Chem Lett 22: 5936-41 (2012)
Article DOI: 10.1016/j.bmcl.2012.07.060
BindingDB Entry DOI: 10.7270/Q25T3MKN