BDBM50390931 CHEMBL2071015
SMILES: OC(=O)c1cc(n[nH]1)[N+]([O-])=O
InChI Key: InChIKey=HKYHBMLIEAMWRO-UHFFFAOYSA-N
Data: 1 KI  1 IC50
Activity Spreadsheet -- Enzyme Inhibition Constant Data from BindingDB
Found 2 hits for monomerid = 50390931
Trg + Lig
Ki
nM
ΔG°
kcal/mole
IC50
nM
Kd
nM
EC50/IC50
nM
koff
s-1
kon
M-1s-1
pHTemp
°C
Lysine-specific demethylase 4C
(Homo sapiens (Human))
BDBM50390931
(CHEMBL2071015)
Show SMILES OC(=O)c1cc(n[nH]1)[N+]([O-])=O
Show InChI InChI=1S/C4H3N3O4/c8-4(9)2-1-3(6-5-2)7(10)11/h1H,(H,5,6)(H,8,9)
>2.00E+5n/an/an/an/an/an/an/an/a
University of Copenhagen
Curated by ChEMBL
Assay Description
Inhibition of KDM4C catalytic core-mediated demethylation of ARK(Me)3STGGK after 30 mins by FDH-coupled assay
Bioorg Med Chem Lett 22: 5811-3 (2012)
Article DOI: 10.1016/j.bmcl.2012.07.091
BindingDB Entry DOI: 10.7270/Q2222VV7
Lysine-specific demethylase 4C
(Homo sapiens (Human))
BDBM50390931
(CHEMBL2071015)
Show SMILES OC(=O)c1cc(n[nH]1)[N+]([O-])=O
Show InChI InChI=1S/C4H3N3O4/c8-4(9)2-1-3(6-5-2)7(10)11/h1H,(H,5,6)(H,8,9)
n/an/a>2.00E+5n/an/an/an/an/an/a
University of Copenhagen
Curated by ChEMBL
Assay Description
Inhibition of KDM4C catalytic core-mediated demethylation of ARK(Me)3STGGK after 30 mins by FDH-coupled assay
Bioorg Med Chem Lett 22: 5811-3 (2012)
Article DOI: 10.1016/j.bmcl.2012.07.091
BindingDB Entry DOI: 10.7270/Q2222VV7