BDBM50390953 CHEMBL2071151
SMILES: OCC1C(Cl)N=NN1c1ccccc1
InChI Key: InChIKey=YVLWGOPVYTWNBP-UHFFFAOYSA-N
Data: 1 KI  1 IC50
Activity Spreadsheet -- Enzyme Inhibition Constant Data from BindingDB
Found 2 hits for monomerid = 50390953
Trg + Lig
Ki
nM
ΔG°
kcal/mole
IC50
nM
Kd
nM
EC50/IC50
nM
koff
s-1
kon
M-1s-1
pHTemp
°C
Lysine-specific demethylase 4C
(Homo sapiens (Human))
BDBM50390953
(CHEMBL2071151)
Show SMILES OCC1C(Cl)N=NN1c1ccccc1 |c:5|
Show InChI InChI=1S/C9H10ClN3O/c10-9-8(6-14)13(12-11-9)7-4-2-1-3-5-7/h1-5,8-9,14H,6H2
>2.00E+5n/an/an/an/an/an/an/an/a
University of Copenhagen
Curated by ChEMBL
Assay Description
Inhibition of KDM4C catalytic core-mediated demethylation of ARK(Me)3STGGK after 30 mins by FDH-coupled assay
Bioorg Med Chem Lett 22: 5811-3 (2012)
Article DOI: 10.1016/j.bmcl.2012.07.091
BindingDB Entry DOI: 10.7270/Q2222VV7
Lysine-specific demethylase 4C
(Homo sapiens (Human))
BDBM50390953
(CHEMBL2071151)
Show SMILES OCC1C(Cl)N=NN1c1ccccc1 |c:5|
Show InChI InChI=1S/C9H10ClN3O/c10-9-8(6-14)13(12-11-9)7-4-2-1-3-5-7/h1-5,8-9,14H,6H2
n/an/a>2.00E+5n/an/an/an/an/an/a
University of Copenhagen
Curated by ChEMBL
Assay Description
Inhibition of KDM4C catalytic core-mediated demethylation of ARK(Me)3STGGK after 30 mins by FDH-coupled assay
Bioorg Med Chem Lett 22: 5811-3 (2012)
Article DOI: 10.1016/j.bmcl.2012.07.091
BindingDB Entry DOI: 10.7270/Q2222VV7