BDBM50391012 CHEMBL2088212
SMILES: CC(C)N(C)[C@@H]1CC[C@H](NC(=O)Cc2nc3cccc(c3[nH]2)C(F)(F)F)[C@H](CS(=O)(=O)c2ccc(Br)cc2)C1
InChI Key: InChIKey=PNNURZBAOYBVQO-KPLVRAHFSA-N
Data: 2 IC50
Activity Spreadsheet -- Enzyme Inhibition Constant Data from BindingDB
Found 2 hits for monomerid = 50391012
Trg + Lig
Ki
nM
ΔG°
kcal/mole
IC50
nM
Kd
nM
EC50/IC50
nM
koff
s-1
kon
M-1s-1
pHTemp
°C
C-C chemokine receptor type 2
(Homo sapiens (Human))
BDBM50391012
(CHEMBL2088212)
Show SMILES CC(C)N(C)[C@@H]1CC[C@H](NC(=O)Cc2nc3cccc(c3[nH]2)C(F)(F)F)[C@H](CS(=O)(=O)c2ccc(Br)cc2)C1 |r|
Show InChI InChI=1S/C27H32BrF3N4O3S/c1-16(2)35(3)19-9-12-22(17(13-19)15-39(37,38)20-10-7-18(28)8-11-20)33-25(36)14-24-32-23-6-4-5-21(26(23)34-24)27(29,30)31/h4-8,10-11,16-17,19,22H,9,12-15H2,1-3H3,(H,32,34)(H,33,36)/t17-,19+,22-/m0/s1
n/an/a 5.70n/an/an/an/an/an/a
Bristol-Myers Squibb Company
Curated by ChEMBL
Assay Description
Antagonist activity at CCR2 in human monocytes by chemotaxis assay in presence of 0.5% bovine serum albumin
Bioorg Med Chem Lett 22: 6181-4 (2012)
Article DOI: 10.1016/j.bmcl.2012.08.002
BindingDB Entry DOI: 10.7270/Q2F47Q62
C-C chemokine receptor type 2
(Homo sapiens (Human))
BDBM50391012
(CHEMBL2088212)
Show SMILES CC(C)N(C)[C@@H]1CC[C@H](NC(=O)Cc2nc3cccc(c3[nH]2)C(F)(F)F)[C@H](CS(=O)(=O)c2ccc(Br)cc2)C1 |r|
Show InChI InChI=1S/C27H32BrF3N4O3S/c1-16(2)35(3)19-9-12-22(17(13-19)15-39(37,38)20-10-7-18(28)8-11-20)33-25(36)14-24-32-23-6-4-5-21(26(23)34-24)27(29,30)31/h4-8,10-11,16-17,19,22H,9,12-15H2,1-3H3,(H,32,34)(H,33,36)/t17-,19+,22-/m0/s1
n/an/a 0.900n/an/an/an/an/an/a
Bristol-Myers Squibb Company
Curated by ChEMBL
Assay Description
Binding affinity to CCR2
Bioorg Med Chem Lett 22: 6181-4 (2012)
Article DOI: 10.1016/j.bmcl.2012.08.002
BindingDB Entry DOI: 10.7270/Q2F47Q62