BDBM50391026 CHEMBL2088400
SMILES: OCc1nc2cc(NC(=O)c3ccc(Cl)cc3)ccc2s1
InChI Key: InChIKey=RNSCUEUDZWDJLR-UHFFFAOYSA-N
Data: 1 IC50
Activity Spreadsheet -- Enzyme Inhibition Constant Data from BindingDB
Found 1 hit for monomerid = 50391026
Trg + Lig
Ki
nM
ΔG°
kcal/mole
IC50
nM
Kd
nM
EC50/IC50
nM
koff
s-1
kon
M-1s-1
pHTemp
°C
Transient receptor potential cation channel subfamily V member 1
(Homo sapiens (Human))
BDBM50391026
(CHEMBL2088400)
Show SMILES OCc1nc2cc(NC(=O)c3ccc(Cl)cc3)ccc2s1
Show InChI InChI=1S/C15H11ClN2O2S/c16-10-3-1-9(2-4-10)15(20)17-11-5-6-13-12(7-11)18-14(8-19)21-13/h1-7,19H,8H2,(H,17,20)
Reactome pathway
n/an/a 68n/an/an/an/an/an/a
AstraZeneca
Curated by ChEMBL
Assay Description
Antagonist activity at human recombinant TRPV1 receptor assessed as inhibition of capsaicin-induced calcium uptake by FLIPR assay
Bioorg Med Chem Lett 22: 6205-11 (2012)
Article DOI: 10.1016/j.bmcl.2012.08.018
BindingDB Entry DOI: 10.7270/Q29C6ZGB