BDBM50391032 CHEMBL2088394
SMILES: CC(C)Oc1ccc(cc1)C(=O)Nc1ccc2sc(CO)nc2c1
InChI Key: InChIKey=MBEJWODRSYRXKF-UHFFFAOYSA-N
Data: 1 IC50
Activity Spreadsheet -- Enzyme Inhibition Constant Data from BindingDB
Found 1 hit for monomerid = 50391032
Trg + Lig
Ki
nM
ΔG°
kcal/mole
IC50
nM
Kd
nM
EC50/IC50
nM
koff
s-1
kon
M-1s-1
pHTemp
°C
Transient receptor potential cation channel subfamily V member 1
(Homo sapiens (Human))
BDBM50391032
(CHEMBL2088394)
Show SMILES CC(C)Oc1ccc(cc1)C(=O)Nc1ccc2sc(CO)nc2c1
Show InChI InChI=1S/C18H18N2O3S/c1-11(2)23-14-6-3-12(4-7-14)18(22)19-13-5-8-16-15(9-13)20-17(10-21)24-16/h3-9,11,21H,10H2,1-2H3,(H,19,22)
Reactome pathway
n/an/a 33n/an/an/an/an/an/a
AstraZeneca
Curated by ChEMBL
Assay Description
Antagonist activity at human recombinant TRPV1 receptor assessed as inhibition of capsaicin-induced calcium uptake by FLIPR assay
Bioorg Med Chem Lett 22: 6205-11 (2012)
Article DOI: 10.1016/j.bmcl.2012.08.018
BindingDB Entry DOI: 10.7270/Q29C6ZGB