BDBM50391053 CHEMBL2088420
SMILES: Cc1cc(Br)ccc1C(=O)Nc1ccc2sc(CO)nc2c1
InChI Key: InChIKey=FHPANBSRFBFWOW-UHFFFAOYSA-N
Data: 1 IC50
Activity Spreadsheet -- Enzyme Inhibition Constant Data from BindingDB
Found 1 hit for monomerid = 50391053
Trg + Lig
Ki
nM
ΔG°
kcal/mole
IC50
nM
Kd
nM
EC50/IC50
nM
koff
s-1
kon
M-1s-1
pHTemp
°C
Transient receptor potential cation channel subfamily V member 1
(Homo sapiens (Human))
BDBM50391053
(CHEMBL2088420)
Show SMILES Cc1cc(Br)ccc1C(=O)Nc1ccc2sc(CO)nc2c1
Show InChI InChI=1S/C16H13BrN2O2S/c1-9-6-10(17)2-4-12(9)16(21)18-11-3-5-14-13(7-11)19-15(8-20)22-14/h2-7,20H,8H2,1H3,(H,18,21)
Reactome pathway
n/an/a 52n/an/an/an/an/an/a
AstraZeneca
Curated by ChEMBL
Assay Description
Antagonist activity at human recombinant TRPV1 receptor assessed as inhibition of capsaicin-induced calcium uptake by FLIPR assay
Bioorg Med Chem Lett 22: 6205-11 (2012)
Article DOI: 10.1016/j.bmcl.2012.08.018
BindingDB Entry DOI: 10.7270/Q29C6ZGB