BDBM50391181 CHEMBL2088658
SMILES: Cc1n[nH]c(=O)c2[nH]c3ccc(F)cc3c12
InChI Key: InChIKey=BNKGKDIILOTIBH-UHFFFAOYSA-N
Data: 3 IC50
Activity Spreadsheet -- Enzyme Inhibition Constant Data from BindingDB
Found 3 hits for monomerid = 50391181
Trg + Lig
Ki
nM
ΔG°
kcal/mole
IC50
nM
Kd
nM
EC50/IC50
nM
koff
s-1
kon
M-1s-1
pHTemp
°C
Dual specificity tyrosine-phosphorylation-regulated kinase 1A
(RAT)
BDBM50391181
(CHEMBL2088658)
Show SMILES Cc1n[nH]c(=O)c2[nH]c3ccc(F)cc3c12
Show InChI InChI=1S/C11H8FN3O/c1-5-9-7-4-6(12)2-3-8(7)13-10(9)11(16)15-14-5/h2-4,13H,1H3,(H,15,16)
n/an/a 5.60E+3n/an/an/an/an/an/a
Universit£ de Nantes
Curated by ChEMBL
Assay Description
Inhibition of rat recombinant GST-tagged DYRK1A expressed in Escherichia coli using myelin basic protein substrate
Eur J Med Chem 57: 225-33 (2012)
Article DOI: 10.1016/j.ejmech.2012.09.001
BindingDB Entry DOI: 10.7270/Q2RF5W4C
Phosphatidylinositol 3-kinase regulatory subunit alpha/4,5-bisphosphate 3-kinase catalytic subunit alpha isoform
(Homo sapiens (Human))
BDBM50391181
(CHEMBL2088658)
Show SMILES Cc1n[nH]c(=O)c2[nH]c3ccc(F)cc3c12
Show InChI InChI=1S/C11H8FN3O/c1-5-9-7-4-6(12)2-3-8(7)13-10(9)11(16)15-14-5/h2-4,13H,1H3,(H,15,16)
n/an/a>1.00E+4n/an/an/an/an/an/a
Universit£ de Nantes
Curated by ChEMBL
Assay Description
Inhibition of PI3K p110alpha/p85alpha by fluorescence based immunoassay
Eur J Med Chem 57: 225-33 (2012)
Article DOI: 10.1016/j.ejmech.2012.09.001
BindingDB Entry DOI: 10.7270/Q2RF5W4C
Cyclin-dependent kinase 5 activator 1
(Homo sapiens (Human))
BDBM50391181
(CHEMBL2088658)
Show SMILES Cc1n[nH]c(=O)c2[nH]c3ccc(F)cc3c12
Show InChI InChI=1S/C11H8FN3O/c1-5-9-7-4-6(12)2-3-8(7)13-10(9)11(16)15-14-5/h2-4,13H,1H3,(H,15,16)
NCI pathway
Reactome pathway
n/an/a>1.00E+4n/an/an/an/an/an/a
Universit£ de Nantes
Curated by ChEMBL
Assay Description
Inhibition of human recombinant CDK5/P25 using myelin basic protein substrate
Eur J Med Chem 57: 225-33 (2012)
Article DOI: 10.1016/j.ejmech.2012.09.001
BindingDB Entry DOI: 10.7270/Q2RF5W4C