BDBM50391493 CHEMBL2147214
SMILES: Cc1ncc(cn1)-c1ccccc1CCNC(=O)c1ccc(OCCC(F)(F)F)nc1
InChI Key: InChIKey=XSDFMPFYIVEUAO-UHFFFAOYSA-N
Data: 3 IC50
Activity Spreadsheet -- Enzyme Inhibition Constant Data from BindingDB
Found 3 hits for monomerid = 50391493
Trg + Lig
Ki
nM
ΔG°
kcal/mole
IC50
nM
Kd
nM
EC50/IC50
nM
koff
s-1
kon
M-1s-1
pHTemp
°C
Sodium channel protein type 9 subunit alpha
(Homo sapiens (Human))
BDBM50391493
(CHEMBL2147214)
Show SMILES Cc1ncc(cn1)-c1ccccc1CCNC(=O)c1ccc(OCCC(F)(F)F)nc1
Show InChI InChI=1S/C22H21F3N4O2/c1-15-27-13-18(14-28-15)19-5-3-2-4-16(19)8-10-26-21(30)17-6-7-20(29-12-17)31-11-9-22(23,24)25/h2-7,12-14H,8-11H2,1H3,(H,26,30)
n/an/a 63n/an/an/an/an/an/a
AstraZeneca
Curated by ChEMBL
Assay Description
Inhibition of human Nav1.7 expressed in HEK293 cells by whole cell voltage-clamp electrophysiology assay
Bioorg Med Chem Lett 22: 6108-15 (2012)
Article DOI: 10.1016/j.bmcl.2012.08.031
BindingDB Entry DOI: 10.7270/Q2B8596S
Sodium channel protein type 5 subunit alpha
(Homo sapiens (Human))
BDBM50391493
(CHEMBL2147214)
Show SMILES Cc1ncc(cn1)-c1ccccc1CCNC(=O)c1ccc(OCCC(F)(F)F)nc1
Show InChI InChI=1S/C22H21F3N4O2/c1-15-27-13-18(14-28-15)19-5-3-2-4-16(19)8-10-26-21(30)17-6-7-20(29-12-17)31-11-9-22(23,24)25/h2-7,12-14H,8-11H2,1H3,(H,26,30)
n/an/a 5.01E+3n/an/an/an/an/an/a
AstraZeneca
Curated by ChEMBL
Assay Description
Inhibition of human Nav1.5
Bioorg Med Chem Lett 22: 6108-15 (2012)
Article DOI: 10.1016/j.bmcl.2012.08.031
BindingDB Entry DOI: 10.7270/Q2B8596S
Potassium voltage-gated channel subfamily H member 2
(Homo sapiens (Human))
BDBM50391493
(CHEMBL2147214)
Show SMILES Cc1ncc(cn1)-c1ccccc1CCNC(=O)c1ccc(OCCC(F)(F)F)nc1
Show InChI InChI=1S/C22H21F3N4O2/c1-15-27-13-18(14-28-15)19-5-3-2-4-16(19)8-10-26-21(30)17-6-7-20(29-12-17)31-11-9-22(23,24)25/h2-7,12-14H,8-11H2,1H3,(H,26,30)
Reactome pathway
n/an/a 1.26E+4n/an/an/an/an/an/a
AstraZeneca
Curated by ChEMBL
Assay Description
Inhibition of human ERG channel by whole cell voltage-clamp electrophysiology assay
Bioorg Med Chem Lett 22: 6108-15 (2012)
Article DOI: 10.1016/j.bmcl.2012.08.031
BindingDB Entry DOI: 10.7270/Q2B8596S