BDBM50391725 CHEMBL2146983
SMILES: COC(=O)C(C)(C)C(c1ccc(Nc2ccc(cc2)C#N)cc1)n1ccnc1
InChI Key: InChIKey=FWYKDSDFSZVULP-UHFFFAOYSA-N
Data: 1 IC50
Activity Spreadsheet -- Enzyme Inhibition Constant Data from BindingDB
Found 1 hit for monomerid = 50391725
Trg + Lig
Ki
nM
ΔG°
kcal/mole
IC50
nM
Kd
nM
EC50/IC50
nM
koff
s-1
kon
M-1s-1
pHTemp
°C
Cytochrome CYP26A1
(Homo sapiens (Human))
BDBM50391725
(CHEMBL2146983)
Show SMILES COC(=O)C(C)(C)C(c1ccc(Nc2ccc(cc2)C#N)cc1)n1ccnc1
Show InChI InChI=1S/C22H22N4O2/c1-22(2,21(27)28-3)20(26-13-12-24-15-26)17-6-10-19(11-7-17)25-18-8-4-16(14-23)5-9-18/h4-13,15,20,25H,1-3H3
Reactome pathway
n/an/a>1.00E+3n/an/an/an/an/an/a
Cardiff University
Curated by ChEMBL
Assay Description
Inhibition of CYP26A1-mediated retionic acid metabolism in human MCF7 cell microsomes using [3H]ATRA as substrate after 1 hr by scintillation countin...
Bioorg Med Chem 20: 6080-8 (2012)
Article DOI: 10.1016/j.bmc.2012.08.044
BindingDB Entry DOI: 10.7270/Q2D21ZQD