BDBM50391767 CHEMBL2146857
SMILES: CCOC(=O)c1ccc(CCN2CCN(CCc3ccc(cc3)[N+]([O-])=O)CC2)cc1
InChI Key: InChIKey=HXQUUYKDCWCSTP-UHFFFAOYSA-N
Data: 2 IC50
Activity Spreadsheet -- Enzyme Inhibition Constant Data from BindingDB
Found 2 hits for monomerid = 50391767
Trg + Lig
Ki
nM
ΔG°
kcal/mole
IC50
nM
Kd
nM
EC50/IC50
nM
koff
s-1
kon
M-1s-1
pHTemp
°C
ATP-sensitive inward rectifier potassium channel 1
(Homo sapiens (Human))
BDBM50391767
(CHEMBL2146857)
Show SMILES CCOC(=O)c1ccc(CCN2CCN(CCc3ccc(cc3)[N+]([O-])=O)CC2)cc1
Show InChI InChI=1S/C23H29N3O4/c1-2-30-23(27)21-7-3-19(4-8-21)11-13-24-15-17-25(18-16-24)14-12-20-5-9-22(10-6-20)26(28)29/h3-10H,2,11-18H2,1H3
Reactome pathway
n/an/a 2.90E+3n/an/an/an/an/an/a
TBA
Curated by ChEMBL
Assay Description
Inhibition of human ROMK1 channel expressed in CHO cells coexpressing DHFR assessed as inhibition of 86Rb+ efflux after 35 mins by TopCount method
ACS Med Chem Lett 3: 367-372 (2012)
Article DOI: 10.1021/ml3000066
BindingDB Entry DOI: 10.7270/Q2MK6DZV
Potassium voltage-gated channel subfamily H member 2
(Homo sapiens (Human))
BDBM50391767
(CHEMBL2146857)
Show SMILES CCOC(=O)c1ccc(CCN2CCN(CCc3ccc(cc3)[N+]([O-])=O)CC2)cc1
Show InChI InChI=1S/C23H29N3O4/c1-2-30-23(27)21-7-3-19(4-8-21)11-13-24-15-17-25(18-16-24)14-12-20-5-9-22(10-6-20)26(28)29/h3-10H,2,11-18H2,1H3
Reactome pathway
n/an/a 19n/an/an/an/an/an/a
TBA
Curated by ChEMBL
Assay Description
Displacement of [35S]MK499 from human ERG
ACS Med Chem Lett 3: 367-372 (2012)
Article DOI: 10.1021/ml3000066
BindingDB Entry DOI: 10.7270/Q2MK6DZV