BDBM50391839 CHEMBL2147034::US9133160, 2
SMILES: Cc1ccncc1-c1cccc2n(cnc12)-c1ccccn1
InChI Key: InChIKey=WDKLQTCTEXQEBO-UHFFFAOYSA-N
Data: 4 IC50
Activity Spreadsheet -- Enzyme Inhibition Constant Data from BindingDB
Found 4 hits for monomerid = 50391839
Trg + Lig
Ki
nM
ΔG°
kcal/mole
IC50
nM
Kd
nM
EC50/IC50
nM
koff
s-1
kon
M-1s-1
pHTemp
°C
Cytochrome P450 17A1
(Homo sapiens (Human))
BDBM50391839
(CHEMBL2147034 | US9133160, 2)
Show SMILES Cc1ccncc1-c1cccc2n(cnc12)-c1ccccn1
Show InChI InChI=1S/C18H14N4/c1-13-8-10-19-11-15(13)14-5-4-6-16-18(14)21-12-22(16)17-7-2-3-9-20-17/h2-12H,1H3
Reactome pathway
US Patent
n/an/a 5.80n/an/an/an/a7.24
Bristol-Meyers Squibb Company
US Patent
Assay Description
The assays were performed in U-bottom 384-well optiplates. The final assay volume was 15 ul prepared from 7.5 ul additions of microsomes (prepared as...
US Patent US9133160 (2015)
BindingDB Entry DOI: 10.7270/Q2KD1WQK
Cytochrome P450 17A1
(Homo sapiens (Human))
BDBM50391839
(CHEMBL2147034 | US9133160, 2)
Show SMILES Cc1ccncc1-c1cccc2n(cnc12)-c1ccccn1
Show InChI InChI=1S/C18H14N4/c1-13-8-10-19-11-15(13)14-5-4-6-16-18(14)21-12-22(16)17-7-2-3-9-20-17/h2-12H,1H3
Reactome pathway
n/an/a 5.80n/an/an/an/an/an/a
TBA
Curated by ChEMBL
Assay Description
Inhibition of CYP17 transfected in human HEK2 cells using [3H]pregnenolone as substrate by SPA assay
ACS Med Chem Lett 3: 614-615 (2012)
Article DOI: 10.1021/ml300157r
BindingDB Entry DOI: 10.7270/Q2V125W6
Cytochrome P450 1A
(Homo sapiens (Human))
BDBM50391839
(CHEMBL2147034 | US9133160, 2)
Show SMILES Cc1ccncc1-c1cccc2n(cnc12)-c1ccccn1
Show InChI InChI=1S/C18H14N4/c1-13-8-10-19-11-15(13)14-5-4-6-16-18(14)21-12-22(16)17-7-2-3-9-20-17/h2-12H,1H3
Reactome pathway
n/an/a 94n/an/an/an/an/an/a
Bristol-Myers Squibb Research and Development
Curated by ChEMBL
Assay Description
Inhibition of CYP1A2 (unknown origin)
ACS Med Chem Lett 7: 40-5 (2016)
BindingDB Entry DOI: 10.7270/Q2TH8PK5
Cytochrome P450 17A1
(Homo sapiens (Human))
BDBM50391839
(CHEMBL2147034 | US9133160, 2)
Show SMILES Cc1ccncc1-c1cccc2n(cnc12)-c1ccccn1
Show InChI InChI=1S/C18H14N4/c1-13-8-10-19-11-15(13)14-5-4-6-16-18(14)21-12-22(16)17-7-2-3-9-20-17/h2-12H,1H3
Reactome pathway
n/an/a 6n/an/an/an/an/an/a
Bristol-Myers Squibb Research and Development
Curated by ChEMBL
Assay Description
Inhibition of human CYP17A1 expressed in HEK293 cell microsomes using [3H]-pregnenolone as substrate incubated for 45 mins by scintillation proximity...
ACS Med Chem Lett 7: 40-5 (2016)
BindingDB Entry DOI: 10.7270/Q2TH8PK5