BDBM50391859 CHEMBL2147282
SMILES: CN(Cc1ccc(F)cc1)C(=O)[C@@H](NC(=O)c1ccc2nc(NC(=O)c3ccccc3-c3ccccc3)ccc2c1)c1ccccc1
InChI Key: InChIKey=MAQKTCKCJHCCLW-BHVANESWSA-N
Data: 1 IC50
Activity Spreadsheet -- Enzyme Inhibition Constant Data from BindingDB
Found 1 hit for monomerid = 50391859
Trg + Lig
Ki
nM
ΔG°
kcal/mole
IC50
nM
Kd
nM
EC50/IC50
nM
koff
s-1
kon
M-1s-1
pHTemp
°C
Microsomal triglyceride transfer protein
(Homo sapiens (Human))
BDBM50391859
(CHEMBL2147282)
Show SMILES CN(Cc1ccc(F)cc1)C(=O)[C@@H](NC(=O)c1ccc2nc(NC(=O)c3ccccc3-c3ccccc3)ccc2c1)c1ccccc1 |r|
Show InChI InChI=1S/C39H31FN4O3/c1-44(25-26-16-20-31(40)21-17-26)39(47)36(28-12-6-3-7-13-28)43-37(45)30-18-22-34-29(24-30)19-23-35(41-34)42-38(46)33-15-9-8-14-32(33)27-10-4-2-5-11-27/h2-24,36H,25H2,1H3,(H,43,45)(H,41,42,46)/t36-/m0/s1
Reactome pathway
n/an/a 2.80n/an/an/an/an/an/a
Pfizer Inc.
Curated by ChEMBL
Assay Description
Inhibition of MTP in human HepG2 cells assessed as inhibition of apoB secretion after 40 hrs by ELISA
Bioorg Med Chem Lett 21: 4150-4 (2011)
Article DOI: 10.1016/j.bmcl.2011.05.099
BindingDB Entry DOI: 10.7270/Q2B27WCR