BDBM50391868 CHEMBL2146489
SMILES: CC(C)Oc1ccc(cc1)-c1ccccc1C(=O)Nc1ccc2cc(ccc2n1)C(=O)N[C@H](C(=O)NCc1ccc(F)cc1)c1ccccc1
InChI Key: InChIKey=WRMIRUYCZLMHOB-LHEWISCISA-N
Data: 2 IC50
Activity Spreadsheet -- Enzyme Inhibition Constant Data from BindingDB
Found 2 hits for monomerid = 50391868
Trg + Lig
Ki
nM
ΔG°
kcal/mole
IC50
nM
Kd
nM
EC50/IC50
nM
koff
s-1
kon
M-1s-1
pHTemp
°C
Microsomal triglyceride transfer protein
(Homo sapiens (Human))
BDBM50391868
(CHEMBL2146489)
Show SMILES CC(C)Oc1ccc(cc1)-c1ccccc1C(=O)Nc1ccc2cc(ccc2n1)C(=O)N[C@H](C(=O)NCc1ccc(F)cc1)c1ccccc1 |r|
Show InChI InChI=1S/C41H35FN4O4/c1-26(2)50-33-20-14-28(15-21-33)34-10-6-7-11-35(34)40(48)45-37-23-17-30-24-31(16-22-36(30)44-37)39(47)46-38(29-8-4-3-5-9-29)41(49)43-25-27-12-18-32(42)19-13-27/h3-24,26,38H,25H2,1-2H3,(H,43,49)(H,46,47)(H,44,45,48)/t38-/m0/s1
Reactome pathway
n/an/a 7.40n/an/an/an/an/an/a
Pfizer Inc.
Curated by ChEMBL
Assay Description
Inhibition of MTP in human HepG2 cells assessed as inhibition of apoB secretion after 40 hrs by ELISA
Bioorg Med Chem Lett 21: 4150-4 (2011)
Article DOI: 10.1016/j.bmcl.2011.05.099
BindingDB Entry DOI: 10.7270/Q2B27WCR
Microsomal triglyceride transfer protein
(Homo sapiens (Human))
BDBM50391868
(CHEMBL2146489)
Show SMILES CC(C)Oc1ccc(cc1)-c1ccccc1C(=O)Nc1ccc2cc(ccc2n1)C(=O)N[C@H](C(=O)NCc1ccc(F)cc1)c1ccccc1 |r|
Show InChI InChI=1S/C41H35FN4O4/c1-26(2)50-33-20-14-28(15-21-33)34-10-6-7-11-35(34)40(48)45-37-23-17-30-24-31(16-22-36(30)44-37)39(47)46-38(29-8-4-3-5-9-29)41(49)43-25-27-12-18-32(42)19-13-27/h3-24,26,38H,25H2,1-2H3,(H,43,49)(H,46,47)(H,44,45,48)/t38-/m0/s1
Reactome pathway
n/an/a 1.20n/an/an/an/an/an/a
Pfizer Inc.
Curated by ChEMBL
Assay Description
Inhibition of MTP in human HepG2 cells assessed as inhibition of apoB secretion after 40 hrs by ELISA
Bioorg Med Chem Lett 21: 4150-4 (2011)
Article DOI: 10.1016/j.bmcl.2011.05.099
BindingDB Entry DOI: 10.7270/Q2B27WCR