BDBM50391910 CHEMBL2147550
SMILES: CC(C)(N)CNc1nc(cc2cnccc12)-c1ccncc1F
InChI Key: InChIKey=DVMQYKHCZLPSAP-UHFFFAOYSA-N
Data: 6 IC50
Activity Spreadsheet -- Enzyme Inhibition Constant Data from BindingDB
Found 6 hits for monomerid = 50391910
Trg + Lig
Ki
nM
ΔG°
kcal/mole
IC50
nM
Kd
nM
EC50/IC50
nM
koff
s-1
kon
M-1s-1
pHTemp
°C
Protein kinase C alpha type
(Homo sapiens (Human))
BDBM50391910
(CHEMBL2147550)
Show SMILES CC(C)(N)CNc1nc(cc2cnccc12)-c1ccncc1F
Show InChI InChI=1S/C17H18FN5/c1-17(2,19)10-22-16-12-3-5-20-8-11(12)7-15(23-16)13-4-6-21-9-14(13)18/h3-9H,10,19H2,1-2H3,(H,22,23)
NCI pathway
Reactome pathway
n/an/a>1.00E+3n/an/an/an/an/an/a
Novartis Institutes for BioMedical Research
Curated by ChEMBL
Assay Description
Inhibition of recombinant human PKCalpha assessed as [33P]-ATP incorporation into tridecapeptide substrate after 60 mins by scintillation proximity a...
Bioorg Med Chem Lett 21: 7367-72 (2011)
Article DOI: 10.1016/j.bmcl.2011.10.025
BindingDB Entry DOI: 10.7270/Q22J6CZ4
Protein kinase C, eta
(Homo sapiens (Human))
BDBM50391910
(CHEMBL2147550)
Show SMILES CC(C)(N)CNc1nc(cc2cnccc12)-c1ccncc1F
Show InChI InChI=1S/C17H18FN5/c1-17(2,19)10-22-16-12-3-5-20-8-11(12)7-15(23-16)13-4-6-21-9-14(13)18/h3-9H,10,19H2,1-2H3,(H,22,23)
NCI pathway
Reactome pathway
n/an/a 18n/an/an/an/an/an/a
Novartis Institutes for BioMedical Research
Curated by ChEMBL
Assay Description
Inhibition of recombinant human PKCeta assessed as [33P]-ATP incorporation into tridecapeptide substrate after 60 mins by scintillation proximity ass...
Bioorg Med Chem Lett 21: 7367-72 (2011)
Article DOI: 10.1016/j.bmcl.2011.10.025
BindingDB Entry DOI: 10.7270/Q22J6CZ4
Protein kinase C theta type
(Homo sapiens (Human))
BDBM50391910
(CHEMBL2147550)
Show SMILES CC(C)(N)CNc1nc(cc2cnccc12)-c1ccncc1F
Show InChI InChI=1S/C17H18FN5/c1-17(2,19)10-22-16-12-3-5-20-8-11(12)7-15(23-16)13-4-6-21-9-14(13)18/h3-9H,10,19H2,1-2H3,(H,22,23)
NCI pathway
Reactome pathway
n/an/a 140n/an/an/an/an/an/a
Novartis Institutes for BioMedical Research
Curated by ChEMBL
Assay Description
Inhibition of recombinant human PKCtheta assessed as [33P]-ATP incorporation into tridecapeptide substrate after 60 mins by scintillation proximity a...
Bioorg Med Chem Lett 21: 7367-72 (2011)
Article DOI: 10.1016/j.bmcl.2011.10.025
BindingDB Entry DOI: 10.7270/Q22J6CZ4
Protein kinase C delta type
(Homo sapiens (Human))
BDBM50391910
(CHEMBL2147550)
Show SMILES CC(C)(N)CNc1nc(cc2cnccc12)-c1ccncc1F
Show InChI InChI=1S/C17H18FN5/c1-17(2,19)10-22-16-12-3-5-20-8-11(12)7-15(23-16)13-4-6-21-9-14(13)18/h3-9H,10,19H2,1-2H3,(H,22,23)
NCI pathway
Reactome pathway
n/an/a 124n/an/an/an/an/an/a
Novartis Institutes for BioMedical Research
Curated by ChEMBL
Assay Description
Inhibition of recombinant human PKCdelta assessed as [33P]-ATP incorporation into tridecapeptide substrate after 60 mins by scintillation proximity a...
Bioorg Med Chem Lett 21: 7367-72 (2011)
Article DOI: 10.1016/j.bmcl.2011.10.025
BindingDB Entry DOI: 10.7270/Q22J6CZ4
Protein kinase C, epsilon
(Homo sapiens (Human))
BDBM50391910
(CHEMBL2147550)
Show SMILES CC(C)(N)CNc1nc(cc2cnccc12)-c1ccncc1F
Show InChI InChI=1S/C17H18FN5/c1-17(2,19)10-22-16-12-3-5-20-8-11(12)7-15(23-16)13-4-6-21-9-14(13)18/h3-9H,10,19H2,1-2H3,(H,22,23)
NCI pathway
Reactome pathway
n/an/a 62n/an/an/an/an/an/a
Novartis Institutes for BioMedical Research
Curated by ChEMBL
Assay Description
Inhibition of recombinant human PKCepsilon assessed as [33P]-ATP incorporation into tridecapeptide substrate after 60 mins by scintillation proximity...
Bioorg Med Chem Lett 21: 7367-72 (2011)
Article DOI: 10.1016/j.bmcl.2011.10.025
BindingDB Entry DOI: 10.7270/Q22J6CZ4
PKC alpha and beta-2
(Homo sapiens (Human))
BDBM50391910
(CHEMBL2147550)
Show SMILES CC(C)(N)CNc1nc(cc2cnccc12)-c1ccncc1F
Show InChI InChI=1S/C17H18FN5/c1-17(2,19)10-22-16-12-3-5-20-8-11(12)7-15(23-16)13-4-6-21-9-14(13)18/h3-9H,10,19H2,1-2H3,(H,22,23)
NCI pathway
Reactome pathway
n/an/a 961n/an/an/an/an/an/a
Novartis Institutes for BioMedical Research
Curated by ChEMBL
Assay Description
Inhibition of recombinant human PKCbeta1 assessed as [33P]-ATP incorporation into tridecapeptide substrate after 60 mins by scintillation proximity a...
Bioorg Med Chem Lett 21: 7367-72 (2011)
Article DOI: 10.1016/j.bmcl.2011.10.025
BindingDB Entry DOI: 10.7270/Q22J6CZ4