BDBM50391955 CHEMBL2152264
SMILES: Nc1cccc(c1)-c1cnc2[nH]cc(-c3ccncc3)c2c1
InChI Key: InChIKey=MJYJMOYFDMVCLO-UHFFFAOYSA-N
Data: 1 IC50  2 Kd
Activity Spreadsheet -- Enzyme Inhibition Constant Data from BindingDB
Found 3 hits for monomerid = 50391955
Trg + Lig
Ki
nM
ΔG°
kcal/mole
IC50
nM
Kd
nM
EC50/IC50
nM
koff
s-1
kon
M-1s-1
pHTemp
°C
High affinity nerve growth factor receptor
(Homo sapiens (Human))
BDBM50391955
(CHEMBL2152264)
Show SMILES Nc1cccc(c1)-c1cnc2[nH]cc(-c3ccncc3)c2c1
Show InChI InChI=1S/C18H14N4/c19-15-3-1-2-13(8-15)14-9-16-17(11-22-18(16)21-10-14)12-4-6-20-7-5-12/h1-11H,19H2,(H,21,22)
n/an/an/a 16n/an/an/an/an/a
Korea Advanced Institute of Science and Technology (KAIST)
Curated by ChEMBL
Assay Description
Binding affinity to TRKA by high throughput assay
J Med Chem 55: 5337-49 (2012)
Article DOI: 10.1021/jm3002982
BindingDB Entry DOI: 10.7270/Q2JM2BQ3
High affinity nerve growth factor receptor
(Homo sapiens (Human))
BDBM50391955
(CHEMBL2152264)
Show SMILES Nc1cccc(c1)-c1cnc2[nH]cc(-c3ccncc3)c2c1
Show InChI InChI=1S/C18H14N4/c19-15-3-1-2-13(8-15)14-9-16-17(11-22-18(16)21-10-14)12-4-6-20-7-5-12/h1-11H,19H2,(H,21,22)
n/an/a 42.7n/an/an/an/an/an/a
Korea Advanced Institute of Science and Technology (KAIST)
Curated by ChEMBL
Assay Description
Inhibition of TRKA assessed as [gamma33P]ATP incorporation into substrate
J Med Chem 55: 5337-49 (2012)
Article DOI: 10.1021/jm3002982
BindingDB Entry DOI: 10.7270/Q2JM2BQ3
Phosphatidylinositol 4,5-bisphosphate 3-kinase catalytic subunit alpha isoform
(Homo sapiens (Human))
BDBM50391955
(CHEMBL2152264)
Show SMILES Nc1cccc(c1)-c1cnc2[nH]cc(-c3ccncc3)c2c1
Show InChI InChI=1S/C18H14N4/c19-15-3-1-2-13(8-15)14-9-16-17(11-22-18(16)21-10-14)12-4-6-20-7-5-12/h1-11H,19H2,(H,21,22)
NCI pathway
Reactome pathway
n/an/an/a 2.90E+3n/an/an/an/an/a
Korea Advanced Institute of Science and Technology (KAIST)
Curated by ChEMBL
Assay Description
Binding affinity to PI3Kalpha by high throughput assay
J Med Chem 55: 5337-49 (2012)
Article DOI: 10.1021/jm3002982
BindingDB Entry DOI: 10.7270/Q2JM2BQ3