BDBM50391987 CHEMBL2151053
SMILES: COC(=O)N[C@H]1CC[C@@H](CC1)n1cnc2cnc3[nH]ccc3c12
InChI Key: InChIKey=BABQSAAUPBKRBJ-XYPYZODXSA-N
Data: 1 KI  1 EC50
Activity Spreadsheet -- Enzyme Inhibition Constant Data from BindingDB
Found 2 hits for monomerid = 50391987
Trg + Lig
Ki
nM
ΔG°
kcal/mole
IC50
nM
Kd
nM
EC50/IC50
nM
koff
s-1
kon
M-1s-1
pHTemp
°C
Tyrosine-protein kinase JAK1
(Homo sapiens (Human))
BDBM50391987
(CHEMBL2151053)
Show SMILES COC(=O)N[C@H]1CC[C@@H](CC1)n1cnc2cnc3[nH]ccc3c12 |r,wU:5.4,wD:8.11,(20.99,-23.11,;19.46,-23.09,;18.68,-24.42,;19.44,-25.76,;17.14,-24.41,;16.36,-25.74,;17.12,-27.08,;16.35,-28.4,;14.8,-28.39,;14.04,-27.06,;14.82,-25.73,;14.03,-29.72,;12.51,-29.56,;11.89,-30.96,;13.03,-31.99,;13.03,-33.53,;14.36,-34.3,;15.69,-33.52,;17.16,-34,;18.06,-32.75,;17.16,-31.5,;15.69,-31.98,;14.35,-31.22,)|
Show InChI InChI=1S/C16H19N5O2/c1-23-16(22)20-10-2-4-11(5-3-10)21-9-19-13-8-18-15-12(14(13)21)6-7-17-15/h6-11H,2-5H2,1H3,(H,17,18)(H,20,22)/t10-,11-
Reactome pathway
9.5n/an/an/an/an/an/an/an/a
Argenta Discovery Ltd.
Curated by ChEMBL
Assay Description
Inhibition of JAK1
J Med Chem 55: 5901-21 (2012)
Article DOI: 10.1021/jm300438j
BindingDB Entry DOI: 10.7270/Q2DV1KZX
Tyrosine-protein kinase JAK1
(Homo sapiens (Human))
BDBM50391987
(CHEMBL2151053)
Show SMILES COC(=O)N[C@H]1CC[C@@H](CC1)n1cnc2cnc3[nH]ccc3c12 |r,wU:5.4,wD:8.11,(20.99,-23.11,;19.46,-23.09,;18.68,-24.42,;19.44,-25.76,;17.14,-24.41,;16.36,-25.74,;17.12,-27.08,;16.35,-28.4,;14.8,-28.39,;14.04,-27.06,;14.82,-25.73,;14.03,-29.72,;12.51,-29.56,;11.89,-30.96,;13.03,-31.99,;13.03,-33.53,;14.36,-34.3,;15.69,-33.52,;17.16,-34,;18.06,-32.75,;17.16,-31.5,;15.69,-31.98,;14.35,-31.22,)|
Show InChI InChI=1S/C16H19N5O2/c1-23-16(22)20-10-2-4-11(5-3-10)21-9-19-13-8-18-15-12(14(13)21)6-7-17-15/h6-11H,2-5H2,1H3,(H,17,18)(H,20,22)/t10-,11-
Reactome pathway
n/an/an/an/a 400n/an/an/an/a
Argenta Discovery Ltd.
Curated by ChEMBL
Assay Description
Inhibition of JAK1 in human TF1 cells assessed as inhibition of IL2-induced STAT3 phosphorylation
J Med Chem 55: 5901-21 (2012)
Article DOI: 10.1021/jm300438j
BindingDB Entry DOI: 10.7270/Q2DV1KZX