BDBM50392015 CHEMBL2152406
SMILES: CN1CCCC[C@H]1C(=O)N1CCC(CC1)n1cnc2cnc3[nH]ccc3c12
InChI Key: InChIKey=RFPXHAIJTDKSBT-KRWDZBQOSA-N
Data: 1 KI  1 EC50
Activity Spreadsheet -- Enzyme Inhibition Constant Data from BindingDB
Found 2 hits for monomerid = 50392015
Trg + Lig
Ki
nM
ΔG°
kcal/mole
IC50
nM
Kd
nM
EC50/IC50
nM
koff
s-1
kon
M-1s-1
pHTemp
°C
Tyrosine-protein kinase JAK1
(Homo sapiens (Human))
BDBM50392015
(CHEMBL2152406)
Show SMILES CN1CCCC[C@H]1C(=O)N1CCC(CC1)n1cnc2cnc3[nH]ccc3c12 |r|
Show InChI InChI=1S/C20H26N6O/c1-24-9-3-2-4-17(24)20(27)25-10-6-14(7-11-25)26-13-23-16-12-22-19-15(18(16)26)5-8-21-19/h5,8,12-14,17H,2-4,6-7,9-11H2,1H3,(H,21,22)/t17-/m0/s1
Reactome pathway
11n/an/an/an/an/an/an/an/a
Argenta Discovery Ltd.
Curated by ChEMBL
Assay Description
Inhibition of JAK1
J Med Chem 55: 5901-21 (2012)
Article DOI: 10.1021/jm300438j
BindingDB Entry DOI: 10.7270/Q2DV1KZX
Tyrosine-protein kinase JAK1
(Homo sapiens (Human))
BDBM50392015
(CHEMBL2152406)
Show SMILES CN1CCCC[C@H]1C(=O)N1CCC(CC1)n1cnc2cnc3[nH]ccc3c12 |r|
Show InChI InChI=1S/C20H26N6O/c1-24-9-3-2-4-17(24)20(27)25-10-6-14(7-11-25)26-13-23-16-12-22-19-15(18(16)26)5-8-21-19/h5,8,12-14,17H,2-4,6-7,9-11H2,1H3,(H,21,22)/t17-/m0/s1
Reactome pathway
n/an/an/an/a 1.80E+3n/an/an/an/a
Argenta Discovery Ltd.
Curated by ChEMBL
Assay Description
Inhibition of JAK1 in human TF1 cells assessed as inhibition of IL2-induced STAT3 phosphorylation
J Med Chem 55: 5901-21 (2012)
Article DOI: 10.1021/jm300438j
BindingDB Entry DOI: 10.7270/Q2DV1KZX