BDBM50392072 CHEMBL562473
SMILES: NC(=O)c1ccccc1Nc1ccc(cc1)-c1ccccc1
InChI Key: InChIKey=AYZCOXNCXGKMLO-UHFFFAOYSA-N
Data: 2 IC50
Activity Spreadsheet -- Enzyme Inhibition Constant Data from BindingDB
Found 2 hits for monomerid = 50392072
Trg + Lig
Ki
nM
ΔG°
kcal/mole
IC50
nM
Kd
nM
EC50/IC50
nM
koff
s-1
kon
M-1s-1
pHTemp
°C
NAD-Dependent Deacetylase Sirtuin-1
(Homo sapiens (Human))
BDBM50392072
(CHEMBL562473)
Show SMILES NC(=O)c1ccccc1Nc1ccc(cc1)-c1ccccc1
Show InChI InChI=1S/C19H16N2O/c20-19(22)17-8-4-5-9-18(17)21-16-12-10-15(11-13-16)14-6-2-1-3-7-14/h1-13,21H,(H2,20,22)
NCI pathway
Reactome pathway
n/an/a>1.00E+5n/an/an/an/an/an/a
Kyoto Prefectural University of Medicine
Curated by ChEMBL
Assay Description
Inhibition of human recombinant SIRT1 using Fluor de Lys-SIRT as substrate incubated for 60 mins prior to substrate addition measured after 60 mins b...
J Med Chem 55: 5760-73 (2012)
Article DOI: 10.1021/jm3002108
BindingDB Entry DOI: 10.7270/Q2WW7JRS
NAD-dependent deacetylase sirtuin 2
(Homo sapiens (Human))
BDBM50392072
(CHEMBL562473)
Show SMILES NC(=O)c1ccccc1Nc1ccc(cc1)-c1ccccc1
Show InChI InChI=1S/C19H16N2O/c20-19(22)17-8-4-5-9-18(17)21-16-12-10-15(11-13-16)14-6-2-1-3-7-14/h1-13,21H,(H2,20,22)
NCI pathway
n/an/a>1.00E+5n/an/an/an/an/an/a
Kyoto Prefectural University of Medicine
Curated by ChEMBL
Assay Description
Inhibition of human recombinant SIRT2 using Fluor de Lys-SIRT as substrate incubated for 60 mins prior to substrate addition measured after 60 mins b...
J Med Chem 55: 5760-73 (2012)
Article DOI: 10.1021/jm3002108
BindingDB Entry DOI: 10.7270/Q2WW7JRS