null
SMILES: NC(=O)c1ccccc1Nc1ccc(cc1)C(O)=O
InChI Key: InChIKey=HTTAQCWJLDYFAF-UHFFFAOYSA-N
Activity Spreadsheet -- Enzyme Inhibition Constant Data from BindingDB
Found 1 hit for monomerid = 50392077
Trg + Lig
Ki
nM
ΔG°
kcal/mole
IC50
nM
Kd
nM
EC50/IC50
nM
koff
s-1
kon
M-1s-1
pHTemp
°C
NAD-dependent protein deacetylase sirtuin-2
(Homo sapiens (Human))
BDBM50392077
(CHEMBL2152580)
Show SMILES NC(=O)c1ccccc1Nc1ccc(cc1)C(O)=O
Show InChI InChI=1S/C14H12N2O3/c15-13(17)11-3-1-2-4-12(11)16-10-7-5-9(6-8-10)14(18)19/h1-8,16H,(H2,15,17)(H,18,19)
NCI pathway
n/an/a>1.00E+5n/an/an/an/an/an/a
Kyoto Prefectural University of Medicine
Curated by ChEMBL
Assay Description
Inhibition of human recombinant SIRT2 using Fluor de Lys-SIRT as substrate incubated for 60 mins prior to substrate addition measured after 60 mins b...
J Med Chem 55: 5760-73 (2012)
Article DOI: 10.1021/jm3002108
BindingDB Entry DOI: 10.7270/Q2WW7JRS