BDBM50392241 CHEMBL2153361
SMILES: CC(C)C[C@@H](NC(=O)[C@@H](CCCCN)NC(=O)[C@@H](CCC(O)=O)NC(=O)[C@@H](Cc1ccccc1)NC(=O)[C@@H](CC(N)=O)NC(=O)[C@@H](C)NC(=O)[C@@H](Cc1ccc(O)cc1)NC(=O)[C@@H](Cc1c[nH]c2cc(F)ccc12)NC(=O)[C@@H](C)NC(=O)[C@H](N)[C@@H](C)O)C(=O)N[C@H](CC(C)C)C(=O)N[C@H](CCCN=C(N)N)C(O)=O
InChI Key: InChIKey=GYJHSDCYPOKOAA-RPKCDFNFSA-N
Data: 1 Kd
Activity Spreadsheet -- Enzyme Inhibition Constant Data from BindingDB
Found 1 hit for monomerid = 50392241
Trg + Lig
Ki
nM
ΔG°
kcal/mole
IC50
nM
Kd
nM
EC50/IC50
nM
koff
s-1
kon
M-1s-1
pHTemp
°C
MDM2-MDMX
(Homo sapiens (Human))
BDBM50392241
(CHEMBL2153361)
Show SMILES CC(C)C[C@@H](NC(=O)[C@@H](CCCCN)NC(=O)[C@@H](CCC(O)=O)NC(=O)[C@@H](Cc1ccccc1)NC(=O)[C@@H](CC(N)=O)NC(=O)[C@@H](C)NC(=O)[C@@H](Cc1ccc(O)cc1)NC(=O)[C@@H](Cc1c[nH]c2cc(F)ccc12)NC(=O)[C@@H](C)NC(=O)[C@H](N)[C@@H](C)O)C(=O)N[C@H](CC(C)C)C(=O)N[C@H](CCCN=C(N)N)C(O)=O |r,wU:84.89,77.81,50.60,37.42,17.22,4.4,98.101,wD:82.86,62.77,45.46,26.34,8.13,90.93,(30.19,-17.41,;30.2,-15.86,;31.53,-15.1,;28.87,-15.09,;28.86,-13.55,;27.52,-12.78,;26.19,-13.56,;26.2,-15.1,;24.85,-12.79,;24.85,-11.25,;26.19,-10.46,;26.19,-8.92,;27.53,-8.17,;27.52,-6.6,;23.53,-13.56,;22.19,-12.78,;22.19,-11.24,;20.86,-13.56,;20.86,-15.1,;22.19,-15.86,;22.19,-17.4,;20.86,-18.17,;23.53,-18.18,;19.52,-12.79,;18.18,-13.56,;18.18,-15.1,;16.85,-12.79,;16.85,-11.25,;18.18,-10.47,;19.52,-11.25,;20.85,-10.46,;20.85,-8.92,;19.52,-8.17,;18.18,-8.94,;15.52,-13.56,;14.18,-12.79,;14.18,-11.25,;12.84,-13.56,;12.85,-15.1,;14.19,-15.86,;15.52,-15.1,;14.18,-17.41,;11.51,-12.79,;10.17,-13.56,;10.18,-15.1,;8.84,-12.79,;8.84,-11.25,;7.51,-13.56,;6.18,-12.79,;6.18,-11.25,;4.84,-13.56,;4.84,-15.1,;6.18,-15.87,;7.51,-15.1,;8.84,-15.88,;8.84,-17.42,;10.18,-18.18,;7.51,-18.18,;6.18,-17.41,;3.5,-12.79,;2.17,-13.56,;2.17,-15.1,;.84,-12.79,;.84,-11.25,;2.17,-10.48,;3.58,-11.1,;4.61,-9.96,;3.83,-8.62,;4.31,-7.15,;3.28,-6,;3.75,-4.54,;1.77,-6.33,;1.3,-7.8,;2.33,-8.95,;-.5,-13.56,;-1.84,-12.79,;-1.83,-11.25,;-3.17,-13.56,;-3.16,-15.11,;-4.5,-12.79,;-5.83,-13.56,;-5.83,-15.1,;-7.17,-12.79,;-8.5,-13.57,;-7.17,-11.25,;-8.5,-10.49,;-5.84,-10.49,;30.19,-12.79,;30.19,-11.25,;31.53,-13.56,;32.86,-12.78,;32.86,-11.24,;34.2,-10.46,;34.2,-8.92,;35.53,-11.23,;34.2,-13.55,;34.2,-15.09,;35.54,-12.77,;36.87,-13.54,;36.87,-15.1,;38.2,-15.85,;38.2,-17.39,;39.54,-18.17,;39.54,-19.71,;38.21,-20.48,;40.88,-20.48,;38.21,-12.78,;39.54,-13.55,;38.19,-11.24,)|
Show InChI InChI=1S/C72H105FN18O18/c1-36(2)28-51(65(102)85-49(71(108)109)17-13-27-79-72(77)78)89-66(103)52(29-37(3)4)88-62(99)47(16-11-12-26-74)83-63(100)48(24-25-58(95)96)84-67(104)54(30-41-14-9-8-10-15-41)91-69(106)56(34-57(75)94)87-60(97)38(5)81-64(101)53(31-42-18-21-45(93)22-19-42)90-68(105)55(32-43-35-80-50-33-44(73)20-23-46(43)50)86-61(98)39(6)82-70(107)59(76)40(7)92/h8-10,14-15,18-23,33,35-40,47-49,51-56,59,80,92-93H,11-13,16-17,24-32,34,74,76H2,1-7H3,(H2,75,94)(H,81,101)(H,82,107)(H,83,100)(H,84,104)(H,85,102)(H,86,98)(H,87,97)(H,88,99)(H,89,103)(H,90,105)(H,91,106)(H,95,96)(H,108,109)(H4,77,78,79)/t38-,39-,40-,47-,48-,49-,51-,52-,53-,54-,55-,56-,59-/m1/s1
NCI pathway
Reactome pathway
n/an/an/a 14n/an/an/an/an/a
University of Maryland
Curated by ChEMBL
Assay Description
Antagonist activity at MDM2 (residues 25 to 109) assessed as inhibition of binding to immobilized p53 (residues 15 to 29) preincubated for 30 mins by...
J Med Chem 55: 6237-41 (2012)
Article DOI: 10.1021/jm3005465
BindingDB Entry DOI: 10.7270/Q20P1143