BDBM50392280 CHEMBL2153648
SMILES: CCOC(=O)c1ccc(cc1)S(=O)(=O)NC(=NC)N1CC(C(=N1)c1ccc(Cl)cc1)c1ccccc1
InChI Key: InChIKey=VLKHGUYUHYHUJC-UHFFFAOYSA-N
Data: 1 IC50
Activity Spreadsheet -- Enzyme Inhibition Constant Data from BindingDB
Found 1 hit for monomerid = 50392280
Trg + Lig
Ki
nM
ΔG°
kcal/mole
IC50
nM
Kd
nM
EC50/IC50
nM
koff
s-1
kon
M-1s-1
pHTemp
°C
Cannabinoid receptor 1
(Homo sapiens (Human))
BDBM50392280
(CHEMBL2153648)
Show SMILES CCOC(=O)c1ccc(cc1)S(=O)(=O)NC(=NC)N1CC(C(=N1)c1ccc(Cl)cc1)c1ccccc1 |w:16.17,c:22|
Show InChI InChI=1S/C26H25ClN4O4S/c1-3-35-25(32)20-11-15-22(16-12-20)36(33,34)30-26(28-2)31-17-23(18-7-5-4-6-8-18)24(29-31)19-9-13-21(27)14-10-19/h4-16,23H,3,17H2,1-2H3,(H,28,30)
NCI pathway
Reactome pathway
n/an/a 100n/an/an/an/an/an/a
Jenrin Discovery
Curated by ChEMBL
Assay Description
Displacement of 3[H]ligand from recombinant human CB1 receptor
Bioorg Med Chem Lett 22: 6173-80 (2012)
Article DOI: 10.1016/j.bmcl.2012.08.004
BindingDB Entry DOI: 10.7270/Q2BV7HR2