BDBM50392484 CHEMBL2152054
SMILES: CC(C)C[C@H](NC(=O)CNC(=O)[C@H](Cc1ccccc1)NC(=O)[C@H](CO)NC(=O)[C@H](CC(N)=O)NC(=O)[C@H](Cc1c[nH]c2ccccc12)NC(=O)[C@H](CC(N)=O)NC(=O)[C@@H](N)Cc1ccc(O)cc1)C(=O)N[C@@H](CCCN)C(=O)N[C@@H](Cc1ccccc1)C(N)=O
InChI Key: InChIKey=HRWKLPOVMNOZNU-INXYWQKQSA-N
Data: 1 EC50
Activity Spreadsheet -- Enzyme Inhibition Constant Data from BindingDB
Found 1 hit for monomerid = 50392484
Trg + Lig
Ki
nM
ΔG°
kcal/mole
IC50
nM
Kd
nM
EC50/IC50
nM
koff
s-1
kon
M-1s-1
pHTemp
°C
G-protein Coupled Receptor 54
(Homo sapiens (Human))
BDBM50392484
(CHEMBL2152054)
Show SMILES CC(C)C[C@H](NC(=O)CNC(=O)[C@H](Cc1ccccc1)NC(=O)[C@H](CO)NC(=O)[C@H](CC(N)=O)NC(=O)[C@H](Cc1c[nH]c2ccccc12)NC(=O)[C@H](CC(N)=O)NC(=O)[C@@H](N)Cc1ccc(O)cc1)C(=O)N[C@@H](CCCN)C(=O)N[C@@H](Cc1ccccc1)C(N)=O |r|
Show InChI InChI=1S/C62H81N15O14/c1-34(2)24-45(58(87)71-43(18-11-23-63)57(86)72-44(54(67)83)26-35-12-5-3-6-13-35)70-53(82)32-69-56(85)46(27-36-14-7-4-8-15-36)74-62(91)50(33-78)77-61(90)49(30-52(66)81)76-59(88)47(28-38-31-68-42-17-10-9-16-40(38)42)75-60(89)48(29-51(65)80)73-55(84)41(64)25-37-19-21-39(79)22-20-37/h3-10,12-17,19-22,31,34,41,43-50,68,78-79H,11,18,23-30,32-33,63-64H2,1-2H3,(H2,65,80)(H2,66,81)(H2,67,83)(H,69,85)(H,70,82)(H,71,87)(H,72,86)(H,73,84)(H,74,91)(H,75,89)(H,76,88)(H,77,90)/t41-,43-,44-,45-,46-,47-,48-,49-,50-/m0/s1
Reactome pathway
n/an/an/an/a 0.290n/an/an/an/a
Takeda Pharmaceutical Company Ltd
Curated by ChEMBL
Assay Description
Agonist activity at human OT7T175 assessed as increase in intracellular calcium level by FLIPR assay
Bioorg Med Chem Lett 22: 6328-32 (2012)
Article DOI: 10.1016/j.bmcl.2012.08.087
BindingDB Entry DOI: 10.7270/Q22F7PJT