BDBM50392515 CHEMBL2152168
SMILES: FC(F)C(F)(F)Oc1cc(F)cc(c1)[C@](Cc1ccccc1)(NC(=O)N[C@H]1CCC(F)(F)C1)c1ccc(Cl)cn1
InChI Key: InChIKey=AMAKXBAXHDIALG-FNZWTVRRSA-N
Data: 2 IC50
Activity Spreadsheet -- Enzyme Inhibition Constant Data from BindingDB
Found 2 hits for monomerid = 50392515
Trg + Lig
Ki
nM
ΔG°
kcal/mole
IC50
nM
Kd
nM
EC50/IC50
nM
koff
s-1
kon
M-1s-1
pHTemp
°C
Cholesteryl ester transfer protein
(Homo sapiens (Human))
BDBM50392515
(CHEMBL2152168)
Show SMILES FC(F)C(F)(F)Oc1cc(F)cc(c1)[C@](Cc1ccccc1)(NC(=O)N[C@H]1CCC(F)(F)C1)c1ccc(Cl)cn1 |r|
Show InChI InChI=1S/C27H23ClF7N3O2/c28-18-6-7-22(36-15-18)26(13-16-4-2-1-3-5-16,38-24(39)37-20-8-9-25(32,33)14-20)17-10-19(29)12-21(11-17)40-27(34,35)23(30)31/h1-7,10-12,15,20,23H,8-9,13-14H2,(H2,37,38,39)/t20-,26-/m0/s1
Reactome pathway
n/an/a 2.72E+3n/an/an/an/an/an/a
Bristol-Myers Squibb
Curated by ChEMBL
Assay Description
Inhibition of CETP in human plasma using [3H]cholesterol ester/HDL as substrate after 10 mins by scintillation counting
Bioorg Med Chem Lett 22: 6503-8 (2012)
Article DOI: 10.1016/j.bmcl.2012.08.011
BindingDB Entry DOI: 10.7270/Q2XP761G
Cholesteryl ester transfer protein
(Homo sapiens (Human))
BDBM50392515
(CHEMBL2152168)
Show SMILES FC(F)C(F)(F)Oc1cc(F)cc(c1)[C@](Cc1ccccc1)(NC(=O)N[C@H]1CCC(F)(F)C1)c1ccc(Cl)cn1 |r|
Show InChI InChI=1S/C27H23ClF7N3O2/c28-18-6-7-22(36-15-18)26(13-16-4-2-1-3-5-16,38-24(39)37-20-8-9-25(32,33)14-20)17-10-19(29)12-21(11-17)40-27(34,35)23(30)31/h1-7,10-12,15,20,23H,8-9,13-14H2,(H2,37,38,39)/t20-,26-/m0/s1
Reactome pathway
n/an/a 7n/an/an/an/an/an/a
Bristol-Myers Squibb
Curated by ChEMBL
Assay Description
Inhibition of human recombinant CETP using [3H]cholesterol ester/HDL as substrate by scintillation proximity assay
Bioorg Med Chem Lett 22: 6503-8 (2012)
Article DOI: 10.1016/j.bmcl.2012.08.011
BindingDB Entry DOI: 10.7270/Q2XP761G