BDBM50392591 CHEMBL2153380
SMILES: CN(C)CC(=O)NS(=C)(=O)c1ccc(cc1)C(=O)Nc1ccc(Cl)cc1C(=O)Nc1ccc(Cl)cn1
InChI Key: InChIKey=YJTDUWMEPUMNAK-UHFFFAOYSA-N
Data: 1 IC50
Activity Spreadsheet -- Enzyme Inhibition Constant Data from BindingDB
Found 1 hit for monomerid = 50392591
Trg + Lig
Ki
nM
ΔG°
kcal/mole
IC50
nM
Kd
nM
EC50/IC50
nM
koff
s-1
kon
M-1s-1
pHTemp
°C
Coagulation factor X
(Homo sapiens (Human))
BDBM50392591
(CHEMBL2153380)
Show SMILES CN(C)CC(=O)NS(=C)(=O)c1ccc(cc1)C(=O)Nc1ccc(Cl)cc1C(=O)Nc1ccc(Cl)cn1
Show InChI InChI=1S/C24H23Cl2N5O4S/c1-31(2)14-22(32)30-36(3,35)18-8-4-15(5-9-18)23(33)28-20-10-6-16(25)12-19(20)24(34)29-21-11-7-17(26)13-27-21/h4-13H,3,14H2,1-2H3,(H,28,33)(H,27,29,34)(H,30,32,35)
Reactome pathway
n/an/a 9n/an/an/an/an/an/a
Zydus Research Centre
Curated by ChEMBL
Assay Description
Inhibition of human F10a using S-2765 as substrate after 45 mins
Eur J Med Chem 58: 136-52 (2012)
Article DOI: 10.1016/j.ejmech.2012.10.005
BindingDB Entry DOI: 10.7270/Q2571D4Q