BDBM50392850 CHEMBL2151191
SMILES: C[C@H]1[C@@H](C)[C@H](O[C@@H]1c1ccc2OCOc2c1)c1ccc2OCOc2c1
InChI Key: InChIKey=QFUXQRHAJWXPGP-YLYZPZNOSA-N
Data: 4 IC50
Activity Spreadsheet -- Enzyme Inhibition Constant Data from BindingDB
Found 4 hits for monomerid = 50392850
Trg + Lig
Ki
nM
ΔG°
kcal/mole
IC50
nM
Kd
nM
EC50/IC50
nM
koff
s-1
kon
M-1s-1
pHTemp
°C
Mitogen-activated protein kinase 14
(Homo sapiens (Human))
BDBM50392850
(CHEMBL2151191)
Show SMILES C[C@H]1[C@@H](C)[C@H](O[C@@H]1c1ccc2OCOc2c1)c1ccc2OCOc2c1 |r|
Show InChI InChI=1S/C20H20O5/c1-11-12(2)20(14-4-6-16-18(8-14)24-10-22-16)25-19(11)13-3-5-15-17(7-13)23-9-21-15/h3-8,11-12,19-20H,9-10H2,1-2H3/t11-,12+,19-,20-/m0/s1
NCI pathway
Reactome pathway
n/an/a 2.52E+5n/an/an/an/an/an/a
TBA
Curated by ChEMBL
Assay Description
Inhibition of p38MAPKalpha using GST-ATF2 (1 to 115) as substrate preincubated for 30 mins before [gamma-32P]-ATP addition measured after 10 mins by ...
ACS Med Chem Lett 3: 721-725 (2012)
Article DOI: 10.1021/ml300129b
BindingDB Entry DOI: 10.7270/Q2ZG6T9C
Mitogen-activated protein kinase 9
(Homo sapiens (Human))
BDBM50392850
(CHEMBL2151191)
Show SMILES C[C@H]1[C@@H](C)[C@H](O[C@@H]1c1ccc2OCOc2c1)c1ccc2OCOc2c1 |r|
Show InChI InChI=1S/C20H20O5/c1-11-12(2)20(14-4-6-16-18(8-14)24-10-22-16)25-19(11)13-3-5-15-17(7-13)23-9-21-15/h3-8,11-12,19-20H,9-10H2,1-2H3/t11-,12+,19-,20-/m0/s1
NCI pathway
Reactome pathway
n/an/a 2.20E+3n/an/an/an/an/an/a
TBA
Curated by ChEMBL
Assay Description
Displacement of FITC-JIP peptide from human His-tagged JNK2alpha2 after 30 mins by fluorescence assay
ACS Med Chem Lett 3: 721-725 (2012)
Article DOI: 10.1021/ml300129b
BindingDB Entry DOI: 10.7270/Q2ZG6T9C
Mitogen-activated protein kinase 9
(Homo sapiens (Human))
BDBM50392850
(CHEMBL2151191)
Show SMILES C[C@H]1[C@@H](C)[C@H](O[C@@H]1c1ccc2OCOc2c1)c1ccc2OCOc2c1 |r|
Show InChI InChI=1S/C20H20O5/c1-11-12(2)20(14-4-6-16-18(8-14)24-10-22-16)25-19(11)13-3-5-15-17(7-13)23-9-21-15/h3-8,11-12,19-20H,9-10H2,1-2H3/t11-,12+,19-,20-/m0/s1
NCI pathway
Reactome pathway
n/an/a 2.50E+3n/an/an/an/an/an/a
TBA
Curated by ChEMBL
Assay Description
Inhibition of human JNK2alpha2 using GST-c-jun (1 to 221) as substrate preincubated for 30 mins before [gamma-32P]-ATP addition measured after 10 min...
ACS Med Chem Lett 3: 721-725 (2012)
Article DOI: 10.1021/ml300129b
BindingDB Entry DOI: 10.7270/Q2ZG6T9C
ERK-2
(Rattus norvegicus (rat))
BDBM50392850
(CHEMBL2151191)
Show SMILES C[C@H]1[C@@H](C)[C@H](O[C@@H]1c1ccc2OCOc2c1)c1ccc2OCOc2c1 |r|
Show InChI InChI=1S/C20H20O5/c1-11-12(2)20(14-4-6-16-18(8-14)24-10-22-16)25-19(11)13-3-5-15-17(7-13)23-9-21-15/h3-8,11-12,19-20H,9-10H2,1-2H3/t11-,12+,19-,20-/m0/s1
Reactome pathway
n/an/a 2.95E+5n/an/an/an/an/an/a
TBA
Curated by ChEMBL
Assay Description
Inhibition of rat ERK2 using Ets1 (1 to 138) as substrate preincubated for 30 mins before [gamma-32P]-ATP addition measured after 10 mins by liquid s...
ACS Med Chem Lett 3: 721-725 (2012)
Article DOI: 10.1021/ml300129b
BindingDB Entry DOI: 10.7270/Q2ZG6T9C