BDBM50393021 CHEMBL2152686
SMILES: CC(=O)N[C@@H](Cc1cnc[nH]1)C(=O)Nc1cccc(n1)-c1ccc(Oc2ccc(F)cc2)cc1
InChI Key: InChIKey=MMSCVGJDFKLQRH-QHCPKHFHSA-N
Data: 1 KI  1 IC50
Activity Spreadsheet -- Enzyme Inhibition Constant Data from BindingDB
Found 2 hits for monomerid = 50393021
Trg + Lig
Ki
nM
ΔG°
kcal/mole
IC50
nM
Kd
nM
EC50/IC50
nM
koff
s-1
kon
M-1s-1
pHTemp
°C
Sodium channel protein type 9 subunit alpha
(Homo sapiens (Human))
BDBM50393021
(CHEMBL2152686)
Show SMILES CC(=O)N[C@@H](Cc1cnc[nH]1)C(=O)Nc1cccc(n1)-c1ccc(Oc2ccc(F)cc2)cc1 |r|
Show InChI InChI=1S/C25H22FN5O3/c1-16(32)29-23(13-19-14-27-15-28-19)25(33)31-24-4-2-3-22(30-24)17-5-9-20(10-6-17)34-21-11-7-18(26)8-12-21/h2-12,14-15,23H,13H2,1H3,(H,27,28)(H,29,32)(H,30,31,33)/t23-/m0/s1
25n/an/an/an/an/an/an/an/a
TBA
Curated by ChEMBL
Assay Description
Blockade of Nav1.7 by electrophysiological patch clamp assay
ACS Med Chem Lett 3: 695-696 (2012)
Article DOI: 10.1021/ml300194f
BindingDB Entry DOI: 10.7270/Q2J967G4
Sodium channel protein type 9 subunit alpha
(Homo sapiens (Human))
BDBM50393021
(CHEMBL2152686)
Show SMILES CC(=O)N[C@@H](Cc1cnc[nH]1)C(=O)Nc1cccc(n1)-c1ccc(Oc2ccc(F)cc2)cc1 |r|
Show InChI InChI=1S/C25H22FN5O3/c1-16(32)29-23(13-19-14-27-15-28-19)25(33)31-24-4-2-3-22(30-24)17-5-9-20(10-6-17)34-21-11-7-18(26)8-12-21/h2-12,14-15,23H,13H2,1H3,(H,27,28)(H,29,32)(H,30,31,33)/t23-/m0/s1
n/an/a 86n/an/an/an/an/an/a
TBA
Curated by ChEMBL
Assay Description
Blockade of Nav1.7 by FLIPR TETRA sodium dye assay in presence of KCl salt
ACS Med Chem Lett 3: 695-696 (2012)
Article DOI: 10.1021/ml300194f
BindingDB Entry DOI: 10.7270/Q2J967G4