BDBM50393046 CHEMBL2152735
SMILES: On1c2ccc(F)cc2[nH]c1=O
InChI Key: InChIKey=RKNTXYLPUYAYST-UHFFFAOYSA-N
Data: 2 IC50
Activity Spreadsheet -- Enzyme Inhibition Constant Data from BindingDB
Found 2 hits for monomerid = 50393046
Trg + Lig
Ki
nM
ΔG°
kcal/mole
IC50
nM
Kd
nM
EC50/IC50
nM
koff
s-1
kon
M-1s-1
pHTemp
°C
D-Amino Acid Oxidase (DAAO)
(Sus scrofa (pig))
BDBM50393046
(CHEMBL2152735)
Show SMILES On1c2ccc(F)cc2[nH]c1=O
Show InChI InChI=1S/C7H5FN2O2/c8-4-1-2-6-5(3-4)9-7(11)10(6)12/h1-3,12H,(H,9,11)
Reactome pathway
n/an/a 1.00E+3n/an/an/an/an/an/a
TBA
Curated by ChEMBL
Assay Description
Inhibition of pig DAAO using D-serine as substrate after 20 mins by horseradish peroxidase-coupled assay
ACS Med Chem Lett 3: 839-843 (2012)
Article DOI: 10.1021/ml300212a
BindingDB Entry DOI: 10.7270/Q2WM1FGX
D-amino-acid oxidase
(Homo sapiens (Human))
BDBM50393046
(CHEMBL2152735)
Show SMILES On1c2ccc(F)cc2[nH]c1=O
Show InChI InChI=1S/C7H5FN2O2/c8-4-1-2-6-5(3-4)9-7(11)10(6)12/h1-3,12H,(H,9,11)
Reactome pathway
n/an/a 900n/an/an/an/an/an/a
TBA
Curated by ChEMBL
Assay Description
Inhibition of human recombinant DAAO expressed in HEK293 cells using D-serine as substrate after 20 mins by horseradish peroxidase-coupled assay
ACS Med Chem Lett 3: 839-843 (2012)
Article DOI: 10.1021/ml300212a
BindingDB Entry DOI: 10.7270/Q2WM1FGX