BDBM50393070 CHEMBL2152731
SMILES: Cc1c(F)ccc2n(O)c(=O)[nH]c12
InChI Key: InChIKey=WRQLISMCPOTYSO-UHFFFAOYSA-N
Data: 2 IC50
Activity Spreadsheet -- Enzyme Inhibition Constant Data from BindingDB
Found 2 hits for monomerid = 50393070
Trg + Lig
Ki
nM
ΔG°
kcal/mole
IC50
nM
Kd
nM
EC50/IC50
nM
koff
s-1
kon
M-1s-1
pHTemp
°C
D-amino-acid oxidase
(Homo sapiens (Human))
BDBM50393070
(CHEMBL2152731)
Show SMILES Cc1c(F)ccc2n(O)c(=O)[nH]c12
Show InChI InChI=1S/C8H7FN2O2/c1-4-5(9)2-3-6-7(4)10-8(12)11(6)13/h2-3,13H,1H3,(H,10,12)
Reactome pathway
n/an/a 70n/an/an/an/an/an/a
TBA
Curated by ChEMBL
Assay Description
Inhibition of human recombinant DAAO expressed in HEK293 cells using D-serine as substrate after 20 mins by horseradish peroxidase-coupled assay
ACS Med Chem Lett 3: 839-843 (2012)
Article DOI: 10.1021/ml300212a
BindingDB Entry DOI: 10.7270/Q2WM1FGX
D-amino-acid oxidase
(Sus scrofa (pig))
BDBM50393070
(CHEMBL2152731)
Show SMILES Cc1c(F)ccc2n(O)c(=O)[nH]c12
Show InChI InChI=1S/C8H7FN2O2/c1-4-5(9)2-3-6-7(4)10-8(12)11(6)13/h2-3,13H,1H3,(H,10,12)
Reactome pathway
n/an/a 700n/an/an/an/an/an/a
TBA
Curated by ChEMBL
Assay Description
Inhibition of pig DAAO using D-serine as substrate after 20 mins by horseradish peroxidase-coupled assay
ACS Med Chem Lett 3: 839-843 (2012)
Article DOI: 10.1021/ml300212a
BindingDB Entry DOI: 10.7270/Q2WM1FGX