BDBM50393101 CHEMBL2152916::US10231967, Example 20i::US8865911, 20i::US8865911, 20i Isomer 1::US8865911, 20i Isomer 2::US9918985, Example 20i Isomer 1
SMILES: CO[C@H]1CC[C@@]2(Cc3ccc(cc3C22N=C(C)C(N)=N2)C#CC2CC2)CC1
InChI Key: InChIKey=ZTHSMBOBTMQWJX-SCTJWGJOSA-N
Data: 12 IC50
Activity Spreadsheet -- Enzyme Inhibition Constant Data from BindingDB
Found 12 hits for monomerid = 50393101
Trg + Lig
Ki
nM
ΔG°
kcal/mole
IC50
nM
Kd
nM
EC50/IC50
nM
koff
s-1
kon
M-1s-1
pHTemp
°C
Beta-secretase 1
(Homo sapiens (Human))
BDBM50393101
(CHEMBL2152916 | US10231967, Example 20i | US886591...)
Show SMILES CO[C@H]1CC[C@@]2(Cc3ccc(cc3C22N=C(C)C(N)=N2)C#CC2CC2)CC1 |r,wD:5.5,2.1,c:20,t:16,(43.93,-2.27,;43.17,-.93,;41.63,-.91,;40.87,.42,;39.33,.44,;38.56,-.89,;37.66,-2.14,;36.19,-1.68,;34.85,-2.46,;33.52,-1.68,;33.52,-.14,;34.85,.63,;36.18,-.13,;37.65,.35,;36.73,1.59,;37.62,2.85,;37.13,4.3,;39.09,2.38,;40.33,3.3,;39.11,.84,;32.19,.63,;30.85,1.4,;29.51,2.17,;28.74,3.49,;27.97,2.16,;39.32,-2.23,;40.86,-2.23,)|
Show InChI InChI=1S/C23H27N3O/c1-15-21(24)26-23(25-15)20-13-17(6-5-16-3-4-16)7-8-18(20)14-22(23)11-9-19(27-2)10-12-22/h7-8,13,16,19H,3-4,9-12,14H2,1-2H3,(H2,24,26)/t19-,22-,23?
US Patent
n/an/a 4.80n/an/an/an/a9.2n/a
Astrazeneca AB
US Patent
Assay Description
TR-FRET AssayThe beta-secretase enzyme used in the TR-FRET is prepared as follows: The cDNA for the soluble part of the human beta-Secretase (AA 1-AA...
US Patent US8865911 (2014)
BindingDB Entry DOI: 10.7270/Q2T72G4T
Beta-secretase 1
(Homo sapiens (Human))
BDBM50393101
(CHEMBL2152916 | US10231967, Example 20i | US886591...)
Show SMILES CO[C@H]1CC[C@@]2(Cc3ccc(cc3C22N=C(C)C(N)=N2)C#CC2CC2)CC1 |r,wD:5.5,2.1,c:20,t:16,(43.93,-2.27,;43.17,-.93,;41.63,-.91,;40.87,.42,;39.33,.44,;38.56,-.89,;37.66,-2.14,;36.19,-1.68,;34.85,-2.46,;33.52,-1.68,;33.52,-.14,;34.85,.63,;36.18,-.13,;37.65,.35,;36.73,1.59,;37.62,2.85,;37.13,4.3,;39.09,2.38,;40.33,3.3,;39.11,.84,;32.19,.63,;30.85,1.4,;29.51,2.17,;28.74,3.49,;27.97,2.16,;39.32,-2.23,;40.86,-2.23,)|
Show InChI InChI=1S/C23H27N3O/c1-15-21(24)26-23(25-15)20-13-17(6-5-16-3-4-16)7-8-18(20)14-22(23)11-9-19(27-2)10-12-22/h7-8,13,16,19H,3-4,9-12,14H2,1-2H3,(H2,24,26)/t19-,22-,23?
US Patent
n/an/a 1.45E+4n/an/an/an/a9.2n/a
Astrazeneca AB
US Patent
Assay Description
The beta-secretase enzyme used in the TR-FRET is prepared as follows: The cDNA for the soluble part of the human beta-Secretase (AA 1-AA 460) was clo...
US Patent US8865911 (2014)
BindingDB Entry DOI: 10.7270/Q2T72G4T
Beta-secretase 1
(Homo sapiens (Human))
BDBM50393101
(CHEMBL2152916 | US10231967, Example 20i | US886591...)
Show SMILES CO[C@H]1CC[C@@]2(Cc3ccc(cc3C22N=C(C)C(N)=N2)C#CC2CC2)CC1 |r,wD:5.5,2.1,c:20,t:16,(43.93,-2.27,;43.17,-.93,;41.63,-.91,;40.87,.42,;39.33,.44,;38.56,-.89,;37.66,-2.14,;36.19,-1.68,;34.85,-2.46,;33.52,-1.68,;33.52,-.14,;34.85,.63,;36.18,-.13,;37.65,.35,;36.73,1.59,;37.62,2.85,;37.13,4.3,;39.09,2.38,;40.33,3.3,;39.11,.84,;32.19,.63,;30.85,1.4,;29.51,2.17,;28.74,3.49,;27.97,2.16,;39.32,-2.23,;40.86,-2.23,)|
Show InChI InChI=1S/C23H27N3O/c1-15-21(24)26-23(25-15)20-13-17(6-5-16-3-4-16)7-8-18(20)14-22(23)11-9-19(27-2)10-12-22/h7-8,13,16,19H,3-4,9-12,14H2,1-2H3,(H2,24,26)/t19-,22-,23?
US Patent
n/an/a 2.20n/an/an/an/a9.2n/a
Astrazeneca AB
US Patent
Assay Description
TR-FRET AssayThe beta-secretase enzyme used in the TR-FRET is prepared as follows: The cDNA for the soluble part of the human beta-Secretase (AA 1-AA...
US Patent US8865911 (2014)
BindingDB Entry DOI: 10.7270/Q2T72G4T
Beta-secretase 1
(Homo sapiens (Human))
BDBM50393101
(CHEMBL2152916 | US10231967, Example 20i | US886591...)
Show SMILES CO[C@H]1CC[C@@]2(Cc3ccc(cc3C22N=C(C)C(N)=N2)C#CC2CC2)CC1 |r,wD:5.5,2.1,c:20,t:16,(43.93,-2.27,;43.17,-.93,;41.63,-.91,;40.87,.42,;39.33,.44,;38.56,-.89,;37.66,-2.14,;36.19,-1.68,;34.85,-2.46,;33.52,-1.68,;33.52,-.14,;34.85,.63,;36.18,-.13,;37.65,.35,;36.73,1.59,;37.62,2.85,;37.13,4.3,;39.09,2.38,;40.33,3.3,;39.11,.84,;32.19,.63,;30.85,1.4,;29.51,2.17,;28.74,3.49,;27.97,2.16,;39.32,-2.23,;40.86,-2.23,)|
Show InChI InChI=1S/C23H27N3O/c1-15-21(24)26-23(25-15)20-13-17(6-5-16-3-4-16)7-8-18(20)14-22(23)11-9-19(27-2)10-12-22/h7-8,13,16,19H,3-4,9-12,14H2,1-2H3,(H2,24,26)/t19-,22-,23?
n/an/a 4.80n/an/an/an/an/an/a
TBA
Curated by ChEMBL
Assay Description
Inhibition of BACE by TR-FRET assay
ACS Med Chem Lett 3: 875-876 (2012)
Article DOI: 10.1021/ml300324q
BindingDB Entry DOI: 10.7270/Q2VM4DC0
Beta-secretase 1
(Homo sapiens (Human))
BDBM50393101
(CHEMBL2152916 | US10231967, Example 20i | US886591...)
Show SMILES CO[C@H]1CC[C@@]2(Cc3ccc(cc3C22N=C(C)C(N)=N2)C#CC2CC2)CC1 |r,wD:5.5,2.1,c:20,t:16,(43.93,-2.27,;43.17,-.93,;41.63,-.91,;40.87,.42,;39.33,.44,;38.56,-.89,;37.66,-2.14,;36.19,-1.68,;34.85,-2.46,;33.52,-1.68,;33.52,-.14,;34.85,.63,;36.18,-.13,;37.65,.35,;36.73,1.59,;37.62,2.85,;37.13,4.3,;39.09,2.38,;40.33,3.3,;39.11,.84,;32.19,.63,;30.85,1.4,;29.51,2.17,;28.74,3.49,;27.97,2.16,;39.32,-2.23,;40.86,-2.23,)|
Show InChI InChI=1S/C23H27N3O/c1-15-21(24)26-23(25-15)20-13-17(6-5-16-3-4-16)7-8-18(20)14-22(23)11-9-19(27-2)10-12-22/h7-8,13,16,19H,3-4,9-12,14H2,1-2H3,(H2,24,26)/t19-,22-,23?
n/an/a 4.60n/an/an/an/an/an/a
TBA
Curated by ChEMBL
Assay Description
Inhibition of BACE by secreted APPbeta release assay
ACS Med Chem Lett 3: 875-876 (2012)
Article DOI: 10.1021/ml300324q
BindingDB Entry DOI: 10.7270/Q2VM4DC0
Beta-secretase 1 (aa 1-460)
(Homo sapiens (Human))
BDBM50393101
(CHEMBL2152916 | US10231967, Example 20i | US886591...)
Show SMILES CO[C@H]1CC[C@@]2(Cc3ccc(cc3C22N=C(C)C(N)=N2)C#CC2CC2)CC1 |r,wD:5.5,2.1,c:20,t:16,(43.93,-2.27,;43.17,-.93,;41.63,-.91,;40.87,.42,;39.33,.44,;38.56,-.89,;37.66,-2.14,;36.19,-1.68,;34.85,-2.46,;33.52,-1.68,;33.52,-.14,;34.85,.63,;36.18,-.13,;37.65,.35,;36.73,1.59,;37.62,2.85,;37.13,4.3,;39.09,2.38,;40.33,3.3,;39.11,.84,;32.19,.63,;30.85,1.4,;29.51,2.17,;28.74,3.49,;27.97,2.16,;39.32,-2.23,;40.86,-2.23,)|
Show InChI InChI=1S/C23H27N3O/c1-15-21(24)26-23(25-15)20-13-17(6-5-16-3-4-16)7-8-18(20)14-22(23)11-9-19(27-2)10-12-22/h7-8,13,16,19H,3-4,9-12,14H2,1-2H3,(H2,24,26)/t19-,22-,23?
US Patent
n/an/a 1.45E+4n/an/an/an/an/an/a
University of Tennessee Health Science Center
Assay Description
The enzyme (truncated form) was diluted to 6 μg/mL (stock 1.3 mg/mL) and the substrate (Europium)CEVNLDAEFK(Qsy7) to 200 nM (stock 120 μM) ...
J Med Chem 50: 3906-20 (2007)
BindingDB Entry DOI: 10.7270/Q2CR5WP7
Beta amyloid A4 protein
(Homo sapiens (Human))
BDBM50393101
(CHEMBL2152916 | US10231967, Example 20i | US886591...)
Show SMILES CO[C@H]1CC[C@@]2(Cc3ccc(cc3C22N=C(C)C(N)=N2)C#CC2CC2)CC1 |r,wD:5.5,2.1,c:20,t:16,(43.93,-2.27,;43.17,-.93,;41.63,-.91,;40.87,.42,;39.33,.44,;38.56,-.89,;37.66,-2.14,;36.19,-1.68,;34.85,-2.46,;33.52,-1.68,;33.52,-.14,;34.85,.63,;36.18,-.13,;37.65,.35,;36.73,1.59,;37.62,2.85,;37.13,4.3,;39.09,2.38,;40.33,3.3,;39.11,.84,;32.19,.63,;30.85,1.4,;29.51,2.17,;28.74,3.49,;27.97,2.16,;39.32,-2.23,;40.86,-2.23,)|
Show InChI InChI=1S/C23H27N3O/c1-15-21(24)26-23(25-15)20-13-17(6-5-16-3-4-16)7-8-18(20)14-22(23)11-9-19(27-2)10-12-22/h7-8,13,16,19H,3-4,9-12,14H2,1-2H3,(H2,24,26)/t19-,22-,23?
Reactome pathway
US Patent
n/an/a 4.60n/an/an/an/an/an/a
Universita degli Studi di Bari
Assay Description
SH-SY5Y cells were cultured in DMEM/F-12 with Glutamax, 10% FCS and 1% non-essential amino acids and cryopreserved and stored at −140° C. at a ...
J Med Chem 50: 4214-21 (2007)
BindingDB Entry DOI: 10.7270/Q2RF5X91
Beta-Secretase (AA 1-460)
(Homo sapiens (Human))
BDBM50393101
(CHEMBL2152916 | US10231967, Example 20i | US886591...)
Show SMILES CO[C@H]1CC[C@@]2(Cc3ccc(cc3C22N=C(C)C(N)=N2)C#CC2CC2)CC1 |r,wD:5.5,2.1,c:20,t:16,(43.93,-2.27,;43.17,-.93,;41.63,-.91,;40.87,.42,;39.33,.44,;38.56,-.89,;37.66,-2.14,;36.19,-1.68,;34.85,-2.46,;33.52,-1.68,;33.52,-.14,;34.85,.63,;36.18,-.13,;37.65,.35,;36.73,1.59,;37.62,2.85,;37.13,4.3,;39.09,2.38,;40.33,3.3,;39.11,.84,;32.19,.63,;30.85,1.4,;29.51,2.17,;28.74,3.49,;27.97,2.16,;39.32,-2.23,;40.86,-2.23,)|
Show InChI InChI=1S/C23H27N3O/c1-15-21(24)26-23(25-15)20-13-17(6-5-16-3-4-16)7-8-18(20)14-22(23)11-9-19(27-2)10-12-22/h7-8,13,16,19H,3-4,9-12,14H2,1-2H3,(H2,24,26)/t19-,22-,23?
Reactome pathway
US Patent
n/an/a 2.20n/an/an/an/an/an/a
Universita degli Studi di Bari
Assay Description
The β-secretase enzyme used in the TR-FRET is prepared as follows: The cDNA for the soluble part of the human β-Secretase (AA 1-AA 460) was...
J Med Chem 50: 4214-21 (2007)
BindingDB Entry DOI: 10.7270/Q2RF5X91
Beta-Secretase (AA 1-460)
(Homo sapiens (Human))
BDBM50393101
(CHEMBL2152916 | US10231967, Example 20i | US886591...)
Show SMILES CO[C@H]1CC[C@@]2(Cc3ccc(cc3C22N=C(C)C(N)=N2)C#CC2CC2)CC1 |r,wD:5.5,2.1,c:20,t:16,(43.93,-2.27,;43.17,-.93,;41.63,-.91,;40.87,.42,;39.33,.44,;38.56,-.89,;37.66,-2.14,;36.19,-1.68,;34.85,-2.46,;33.52,-1.68,;33.52,-.14,;34.85,.63,;36.18,-.13,;37.65,.35,;36.73,1.59,;37.62,2.85,;37.13,4.3,;39.09,2.38,;40.33,3.3,;39.11,.84,;32.19,.63,;30.85,1.4,;29.51,2.17,;28.74,3.49,;27.97,2.16,;39.32,-2.23,;40.86,-2.23,)|
Show InChI InChI=1S/C23H27N3O/c1-15-21(24)26-23(25-15)20-13-17(6-5-16-3-4-16)7-8-18(20)14-22(23)11-9-19(27-2)10-12-22/h7-8,13,16,19H,3-4,9-12,14H2,1-2H3,(H2,24,26)/t19-,22-,23?
Reactome pathway
US Patent
n/an/a 2.20n/an/an/an/an/an/a
Universita degli Studi di Bari
Assay Description
The β-secretase enzyme used in the TR-FRET is prepared as follows: The cDNA for the soluble part of the human β-Secretase (AA 1-AA 460) was...
J Med Chem 50: 4214-21 (2007)
BindingDB Entry DOI: 10.7270/Q2RF5X91
Beta amyloid A4 protein
(Homo sapiens (Human))
BDBM50393101
(CHEMBL2152916 | US10231967, Example 20i | US886591...)
Show SMILES CO[C@H]1CC[C@@]2(Cc3ccc(cc3C22N=C(C)C(N)=N2)C#CC2CC2)CC1 |r,wD:5.5,2.1,c:20,t:16,(43.93,-2.27,;43.17,-.93,;41.63,-.91,;40.87,.42,;39.33,.44,;38.56,-.89,;37.66,-2.14,;36.19,-1.68,;34.85,-2.46,;33.52,-1.68,;33.52,-.14,;34.85,.63,;36.18,-.13,;37.65,.35,;36.73,1.59,;37.62,2.85,;37.13,4.3,;39.09,2.38,;40.33,3.3,;39.11,.84,;32.19,.63,;30.85,1.4,;29.51,2.17,;28.74,3.49,;27.97,2.16,;39.32,-2.23,;40.86,-2.23,)|
Show InChI InChI=1S/C23H27N3O/c1-15-21(24)26-23(25-15)20-13-17(6-5-16-3-4-16)7-8-18(20)14-22(23)11-9-19(27-2)10-12-22/h7-8,13,16,19H,3-4,9-12,14H2,1-2H3,(H2,24,26)/t19-,22-,23?
Reactome pathway
US Patent
n/an/a 2.30n/an/an/an/an/an/a
Universita degli Studi di Bari
Assay Description
SH-SY5Y cells were cultured in DMEM/F-12 with Glutamax, 10% FCS and 1% non-essential amino acids and cryopreserved and stored at −140° C. at a ...
J Med Chem 50: 4214-21 (2007)
BindingDB Entry DOI: 10.7270/Q2RF5X91
Beta-secretase 1 (aa 1-460)
(Homo sapiens (Human))
BDBM50393101
(CHEMBL2152916 | US10231967, Example 20i | US886591...)
Show SMILES CO[C@H]1CC[C@@]2(Cc3ccc(cc3C22N=C(C)C(N)=N2)C#CC2CC2)CC1 |r,wD:5.5,2.1,c:20,t:16,(43.93,-2.27,;43.17,-.93,;41.63,-.91,;40.87,.42,;39.33,.44,;38.56,-.89,;37.66,-2.14,;36.19,-1.68,;34.85,-2.46,;33.52,-1.68,;33.52,-.14,;34.85,.63,;36.18,-.13,;37.65,.35,;36.73,1.59,;37.62,2.85,;37.13,4.3,;39.09,2.38,;40.33,3.3,;39.11,.84,;32.19,.63,;30.85,1.4,;29.51,2.17,;28.74,3.49,;27.97,2.16,;39.32,-2.23,;40.86,-2.23,)|
Show InChI InChI=1S/C23H27N3O/c1-15-21(24)26-23(25-15)20-13-17(6-5-16-3-4-16)7-8-18(20)14-22(23)11-9-19(27-2)10-12-22/h7-8,13,16,19H,3-4,9-12,14H2,1-2H3,(H2,24,26)/t19-,22-,23?
US Patent
n/an/a 4.80n/an/an/an/an/an/a
University of Tennessee Health Science Center
Assay Description
The enzyme (truncated form) was diluted to 6 μg/mL (stock 1.3 mg/mL) and the substrate (Europium)CEVNLDAEFK(Qsy7) to 200 nM (stock 120 μM) ...
J Med Chem 50: 3906-20 (2007)
BindingDB Entry DOI: 10.7270/Q2CR5WP7
Beta-Secretase (AA 1-460)
(Homo sapiens (Human))
BDBM50393101
(CHEMBL2152916 | US10231967, Example 20i | US886591...)
Show SMILES CO[C@H]1CC[C@@]2(Cc3ccc(cc3C22N=C(C)C(N)=N2)C#CC2CC2)CC1 |r,wD:5.5,2.1,c:20,t:16,(43.93,-2.27,;43.17,-.93,;41.63,-.91,;40.87,.42,;39.33,.44,;38.56,-.89,;37.66,-2.14,;36.19,-1.68,;34.85,-2.46,;33.52,-1.68,;33.52,-.14,;34.85,.63,;36.18,-.13,;37.65,.35,;36.73,1.59,;37.62,2.85,;37.13,4.3,;39.09,2.38,;40.33,3.3,;39.11,.84,;32.19,.63,;30.85,1.4,;29.51,2.17,;28.74,3.49,;27.97,2.16,;39.32,-2.23,;40.86,-2.23,)|
Show InChI InChI=1S/C23H27N3O/c1-15-21(24)26-23(25-15)20-13-17(6-5-16-3-4-16)7-8-18(20)14-22(23)11-9-19(27-2)10-12-22/h7-8,13,16,19H,3-4,9-12,14H2,1-2H3,(H2,24,26)/t19-,22-,23?
Reactome pathway
US Patent
n/an/a 4.80n/an/an/an/an/an/a
Universita degli Studi di Bari
Assay Description
The β-secretase enzyme used in the TR-FRET is prepared as follows: The cDNA for the soluble part of the human β-Secretase (AA 1-AA 460) was...
J Med Chem 50: 4214-21 (2007)
BindingDB Entry DOI: 10.7270/Q2RF5X91