BDBM50393283 CHEMBL2144203
SMILES: C[C@H](Nc1nc(nnc1-c1ccccc1)-c1ccccn1)C1CCCCC1
InChI Key: InChIKey=SWSOEWNFYYVHKJ-INIZCTEOSA-N
Data: 3 EC50
Activity Spreadsheet -- Enzyme Inhibition Constant Data from BindingDB
Found 3 hits for monomerid = 50393283
Trg + Lig
Ki
nM
ΔG°
kcal/mole
IC50
nM
Kd
nM
EC50/IC50
nM
koff
s-1
kon
M-1s-1
pHTemp
°C
Hypoxia-inducible factor 1-alpha
(Homo sapiens (Human))
BDBM50393283
(CHEMBL2144203)
Show SMILES C[C@H](Nc1nc(nnc1-c1ccccc1)-c1ccccn1)C1CCCCC1
Show InChI InChI=1S/C22H25N5/c1-16(17-10-4-2-5-11-17)24-22-20(18-12-6-3-7-13-18)26-27-21(25-22)19-14-8-9-15-23-19/h3,6-9,12-17H,2,4-5,10-11H2,1H3,(H,24,25,27)/t16-/m0/s1
Reactome pathway
n/an/an/an/a 4.17E+3n/an/an/an/a
The Broad Institute Probe Development Center
Curated by ChEMBL
Assay Description
Activation of human HIF1alpha expressed in DFX-induced human U2OS cells incubated for 30 mins prior to DFX-induction measured after overnight incubat...
Bioorg Med Chem Lett 22: 76-81 (2011)
Article DOI: 10.1016/j.bmcl.2011.11.077
BindingDB Entry DOI: 10.7270/Q2XD12SN
Hypoxia-inducible factor 1-alpha
(Homo sapiens (Human))
BDBM50393283
(CHEMBL2144203)
Show SMILES C[C@H](Nc1nc(nnc1-c1ccccc1)-c1ccccn1)C1CCCCC1
Show InChI InChI=1S/C22H25N5/c1-16(17-10-4-2-5-11-17)24-22-20(18-12-6-3-7-13-18)26-27-21(25-22)19-14-8-9-15-23-19/h3,6-9,12-17H,2,4-5,10-11H2,1H3,(H,24,25,27)/t16-/m0/s1
Reactome pathway
n/an/an/an/a 2.55E+3n/an/an/an/a
The Broad Institute Probe Development Center
Curated by ChEMBL
Assay Description
Activation of human HIF1alpha expressed in human U2OS cells assessed as increase in VEGF expression by RT-PCR analysis
Bioorg Med Chem Lett 22: 76-81 (2011)
Article DOI: 10.1016/j.bmcl.2011.11.077
BindingDB Entry DOI: 10.7270/Q2XD12SN
Hypoxia-inducible factor 1-alpha
(Homo sapiens (Human))
BDBM50393283
(CHEMBL2144203)
Show SMILES C[C@H](Nc1nc(nnc1-c1ccccc1)-c1ccccn1)C1CCCCC1
Show InChI InChI=1S/C22H25N5/c1-16(17-10-4-2-5-11-17)24-22-20(18-12-6-3-7-13-18)26-27-21(25-22)19-14-8-9-15-23-19/h3,6-9,12-17H,2,4-5,10-11H2,1H3,(H,24,25,27)/t16-/m0/s1
Reactome pathway
n/an/an/an/a 2.06E+3n/an/an/an/a
The Broad Institute Probe Development Center
Curated by ChEMBL
Assay Description
Activation of GFP-tagged HIF1alpha expressed in human U2OS cells assessed as HIF1alpha nuclear translocation by high content imaging assay
Bioorg Med Chem Lett 22: 76-81 (2011)
Article DOI: 10.1016/j.bmcl.2011.11.077
BindingDB Entry DOI: 10.7270/Q2XD12SN