BDBM50393289 CHEMBL2137226
SMILES: Clc1cccc(CNc2nc(nnc2-c2ccccc2)-c2ccccn2)c1
InChI Key: InChIKey=FWCNXQLOVXPNKX-UHFFFAOYSA-N
Data: 3 EC50
Activity Spreadsheet -- Enzyme Inhibition Constant Data from BindingDB
Found 3 hits for monomerid = 50393289
Trg + Lig
Ki
nM
ΔG°
kcal/mole
IC50
nM
Kd
nM
EC50/IC50
nM
koff
s-1
kon
M-1s-1
pHTemp
°C
Hypoxia-inducible factor 1-alpha
(Homo sapiens (Human))
BDBM50393289
(CHEMBL2137226)
Show SMILES Clc1cccc(CNc2nc(nnc2-c2ccccc2)-c2ccccn2)c1
Show InChI InChI=1S/C21H16ClN5/c22-17-10-6-7-15(13-17)14-24-21-19(16-8-2-1-3-9-16)26-27-20(25-21)18-11-4-5-12-23-18/h1-13H,14H2,(H,24,25,27)
Reactome pathway
n/an/an/an/a 2.33E+3n/an/an/an/a
The Broad Institute Probe Development Center
Curated by ChEMBL
Assay Description
Activation of human HIF1alpha expressed in DFX-induced human U2OS cells incubated for 30 mins prior to DFX-induction measured after overnight incubat...
Bioorg Med Chem Lett 22: 76-81 (2011)
Article DOI: 10.1016/j.bmcl.2011.11.077
BindingDB Entry DOI: 10.7270/Q2XD12SN
Hypoxia-inducible factor 1-alpha
(Homo sapiens (Human))
BDBM50393289
(CHEMBL2137226)
Show SMILES Clc1cccc(CNc2nc(nnc2-c2ccccc2)-c2ccccn2)c1
Show InChI InChI=1S/C21H16ClN5/c22-17-10-6-7-15(13-17)14-24-21-19(16-8-2-1-3-9-16)26-27-20(25-21)18-11-4-5-12-23-18/h1-13H,14H2,(H,24,25,27)
Reactome pathway
n/an/an/an/a 2.77E+3n/an/an/an/a
The Broad Institute Probe Development Center
Curated by ChEMBL
Assay Description
Activation of human HIF1alpha expressed in human U2OS cells assessed as increase in VEGF expression by RT-PCR analysis
Bioorg Med Chem Lett 22: 76-81 (2011)
Article DOI: 10.1016/j.bmcl.2011.11.077
BindingDB Entry DOI: 10.7270/Q2XD12SN
Hypoxia-inducible factor 1-alpha
(Homo sapiens (Human))
BDBM50393289
(CHEMBL2137226)
Show SMILES Clc1cccc(CNc2nc(nnc2-c2ccccc2)-c2ccccn2)c1
Show InChI InChI=1S/C21H16ClN5/c22-17-10-6-7-15(13-17)14-24-21-19(16-8-2-1-3-9-16)26-27-20(25-21)18-11-4-5-12-23-18/h1-13H,14H2,(H,24,25,27)
Reactome pathway
n/an/an/an/a 1.49E+3n/an/an/an/a
The Broad Institute Probe Development Center
Curated by ChEMBL
Assay Description
Activation of GFP-tagged HIF1alpha expressed in human U2OS cells assessed as HIF1alpha nuclear translocation by high content imaging assay
Bioorg Med Chem Lett 22: 76-81 (2011)
Article DOI: 10.1016/j.bmcl.2011.11.077
BindingDB Entry DOI: 10.7270/Q2XD12SN