BDBM50393354 CHEMBL2152145
SMILES: CNC(=O)c1nc(cnc1N)-c1ccc(Cl)c(c1)S(=O)(=O)Nc1ccccc1Cl
InChI Key: InChIKey=OZYUKAKKGKFWMK-UHFFFAOYSA-N
Data: 5 IC50
Activity Spreadsheet -- Enzyme Inhibition Constant Data from BindingDB
Found 5 hits for monomerid = 50393354
Trg + Lig
Ki
nM
ΔG°
kcal/mole
IC50
nM
Kd
nM
EC50/IC50
nM
koff
s-1
kon
M-1s-1
pHTemp
°C
Phosphatidylinositol 4,5-bisphosphate 3-kinase catalytic subunit gamma isoform
(Homo sapiens (Human))
BDBM50393354
(CHEMBL2152145)
Show SMILES CNC(=O)c1nc(cnc1N)-c1ccc(Cl)c(c1)S(=O)(=O)Nc1ccccc1Cl
Show InChI InChI=1S/C18H15Cl2N5O3S/c1-22-18(26)16-17(21)23-9-14(24-16)10-6-7-12(20)15(8-10)29(27,28)25-13-5-3-2-4-11(13)19/h2-9,25H,1H3,(H2,21,23)(H,22,26)
NCI pathway
Reactome pathway
n/an/a 20n/an/an/an/an/an/a
Exelixis
Curated by ChEMBL
Assay Description
Inhibition of human PI3Kgamma expressed in sf9 cells assessed as amount of ATP consumed by luciferase-luciferin chemiluminescence assay
J Med Chem 55: 5467-82 (2012)
Article DOI: 10.1021/jm300403a
BindingDB Entry DOI: 10.7270/Q2DF6S9N
Phosphatidylinositol 4,5-bisphosphate 3-kinase catalytic subunit alpha isoform
(Homo sapiens (Human))
BDBM50393354
(CHEMBL2152145)
Show SMILES CNC(=O)c1nc(cnc1N)-c1ccc(Cl)c(c1)S(=O)(=O)Nc1ccccc1Cl
Show InChI InChI=1S/C18H15Cl2N5O3S/c1-22-18(26)16-17(21)23-9-14(24-16)10-6-7-12(20)15(8-10)29(27,28)25-13-5-3-2-4-11(13)19/h2-9,25H,1H3,(H2,21,23)(H,22,26)
NCI pathway
Reactome pathway
n/an/a 476n/an/an/an/an/an/a
Exelixis
Curated by ChEMBL
Assay Description
Inhibition of human PI3Kalpha expressed in sf9 cells coexpressing p85alpha assessed as amount of ATP consumed by luciferase-luciferin chemiluminescen...
J Med Chem 55: 5467-82 (2012)
Article DOI: 10.1021/jm300403a
BindingDB Entry DOI: 10.7270/Q2DF6S9N
Phosphatidylinositol 4,5-bisphosphate 3-kinase catalytic subunit gamma isoform
(Homo sapiens (Human))
BDBM50393354
(CHEMBL2152145)
Show SMILES CNC(=O)c1nc(cnc1N)-c1ccc(Cl)c(c1)S(=O)(=O)Nc1ccccc1Cl
Show InChI InChI=1S/C18H15Cl2N5O3S/c1-22-18(26)16-17(21)23-9-14(24-16)10-6-7-12(20)15(8-10)29(27,28)25-13-5-3-2-4-11(13)19/h2-9,25H,1H3,(H2,21,23)(H,22,26)
NCI pathway
Reactome pathway
n/an/a 507n/an/an/an/an/an/a
Exelixis
Curated by ChEMBL
Assay Description
Inhibition of human PI3Kgamma expressed in C5a-stimulated mouse RAW 264.7 cells assessed as inhibition of AKT phosphorylation by ELISA
J Med Chem 55: 5467-82 (2012)
Article DOI: 10.1021/jm300403a
BindingDB Entry DOI: 10.7270/Q2DF6S9N
Phosphatidylinositol 4,5-bisphosphate 3-kinase catalytic subunit delta isoform
(Homo sapiens (Human))
BDBM50393354
(CHEMBL2152145)
Show SMILES CNC(=O)c1nc(cnc1N)-c1ccc(Cl)c(c1)S(=O)(=O)Nc1ccccc1Cl
Show InChI InChI=1S/C18H15Cl2N5O3S/c1-22-18(26)16-17(21)23-9-14(24-16)10-6-7-12(20)15(8-10)29(27,28)25-13-5-3-2-4-11(13)19/h2-9,25H,1H3,(H2,21,23)(H,22,26)
NCI pathway
Reactome pathway
n/an/a 1.02E+3n/an/an/an/an/an/a
Exelixis
Curated by ChEMBL
Assay Description
Inhibition of human PI3Kdelta expressed in sf9 cells coexpressing p85alpha assessed as amount of ATP consumed by luciferase-luciferin chemiluminescen...
J Med Chem 55: 5467-82 (2012)
Article DOI: 10.1021/jm300403a
BindingDB Entry DOI: 10.7270/Q2DF6S9N
Phosphatidylinositol 4,5-bisphosphate 3-kinase catalytic subunit beta isoform
(Homo sapiens (Human))
BDBM50393354
(CHEMBL2152145)
Show SMILES CNC(=O)c1nc(cnc1N)-c1ccc(Cl)c(c1)S(=O)(=O)Nc1ccccc1Cl
Show InChI InChI=1S/C18H15Cl2N5O3S/c1-22-18(26)16-17(21)23-9-14(24-16)10-6-7-12(20)15(8-10)29(27,28)25-13-5-3-2-4-11(13)19/h2-9,25H,1H3,(H2,21,23)(H,22,26)
NCI pathway
Reactome pathway
n/an/a 2.40E+3n/an/an/an/an/an/a
Exelixis
Curated by ChEMBL
Assay Description
Inhibition of human PI3Kbeta expressed in sf9 cells coexpressing p85alpha assessed as amount of ATP consumed by luciferase-luciferin chemiluminescenc...
J Med Chem 55: 5467-82 (2012)
Article DOI: 10.1021/jm300403a
BindingDB Entry DOI: 10.7270/Q2DF6S9N