BDBM50393518 CHEMBL2158064
SMILES: COc1ccc(cc1OC1CCCC1)[C@H]1CN(Cc2ccccc2)C(=O)C1
InChI Key: InChIKey=BVWBCENEPRSZES-LJQANCHMSA-N
Data: 1 IC50
Activity Spreadsheet -- Enzyme Inhibition Constant Data from BindingDB
Found 1 hit for monomerid = 50393518
Trg + Lig
Ki
nM
ΔG°
kcal/mole
IC50
nM
Kd
nM
EC50/IC50
nM
koff
s-1
kon
M-1s-1
pHTemp
°C
cAMP-specific 3',5'-cyclic phosphodiesterase 4A
(Homo sapiens (Human))
BDBM50393518
(CHEMBL2158064)
Show SMILES COc1ccc(cc1OC1CCCC1)[C@H]1CN(Cc2ccccc2)C(=O)C1 |r|
Show InChI InChI=1S/C23H27NO3/c1-26-21-12-11-18(13-22(21)27-20-9-5-6-10-20)19-14-23(25)24(16-19)15-17-7-3-2-4-8-17/h2-4,7-8,11-13,19-20H,5-6,9-10,14-16H2,1H3/t19-/m1/s1
n/an/a 730n/an/an/an/an/an/a
University of Glasgow
Curated by ChEMBL
Assay Description
Inhibition of full-length PDE4A4 using cAMP as substrate by two-step radiochemical assay
J Med Chem 54: 3331-47 (2011)
Article DOI: 10.1021/jm200070e
BindingDB Entry DOI: 10.7270/Q2CF9R75