BDBM50393520 CHEMBL2158066
SMILES: COc1ccc(cc1OC)[C@H]1CNC(=O)C1
InChI Key: InChIKey=JNRKFSJWVCILHE-SECBINFHSA-N
Data: 1 IC50
Activity Spreadsheet -- Enzyme Inhibition Constant Data from BindingDB
Found 1 hit for monomerid = 50393520
Trg + Lig
Ki
nM
ΔG°
kcal/mole
IC50
nM
Kd
nM
EC50/IC50
nM
koff
s-1
kon
M-1s-1
pHTemp
°C
cAMP-specific 3',5'-cyclic phosphodiesterase 4A
(Homo sapiens (Human))
BDBM50393520
(CHEMBL2158066)
Show SMILES COc1ccc(cc1OC)[C@H]1CNC(=O)C1 |r|
Show InChI InChI=1S/C12H15NO3/c1-15-10-4-3-8(5-11(10)16-2)9-6-12(14)13-7-9/h3-5,9H,6-7H2,1-2H3,(H,13,14)/t9-/m1/s1
n/an/a 4.40E+4n/an/an/an/an/an/a
University of Glasgow
Curated by ChEMBL
Assay Description
Inhibition of full-length PDE4A4 using cAMP as substrate by two-step radiochemical assay
J Med Chem 54: 3331-47 (2011)
Article DOI: 10.1021/jm200070e
BindingDB Entry DOI: 10.7270/Q2CF9R75