BDBM50393615 CHEMBL2158526
SMILES: COc1cc(ccc1Nc1ncc2ccc(-c3ccccc3N(C)S(C)(=O)=O)n2n1)C1CCN(C[C@@H](C)O)CC1
InChI Key: InChIKey=ROGKAFOTXRPAFP-HXUWFJFHSA-N
Data: 2 IC50
Activity Spreadsheet -- Enzyme Inhibition Constant Data from BindingDB
Found 2 hits for monomerid = 50393615
Trg + Lig
Ki
nM
ΔG°
kcal/mole
IC50
nM
Kd
nM
EC50/IC50
nM
koff
s-1
kon
M-1s-1
pHTemp
°C
ALK tyrosine kinase receptor/Nucleophosmin
(Homo sapiens (Human))
BDBM50393615
(CHEMBL2158526)
Show SMILES COc1cc(ccc1Nc1ncc2ccc(-c3ccccc3N(C)S(C)(=O)=O)n2n1)C1CCN(C[C@@H](C)O)CC1 |r|
Show InChI InChI=1S/C29H36N6O4S/c1-20(36)19-34-15-13-21(14-16-34)22-9-11-25(28(17-22)39-3)31-29-30-18-23-10-12-27(35(23)32-29)24-7-5-6-8-26(24)33(2)40(4,37)38/h5-12,17-18,20-21,36H,13-16,19H2,1-4H3,(H,31,32)/t20-/m1/s1
n/an/a 70n/an/an/an/an/an/a
Cephalon, Inc.
Curated by ChEMBL
Assay Description
Inhibition of human NPM-ALK phosphorylation using 4-MeUP substrate by cell based assay
J Med Chem 55: 115-25 (2012)
Article DOI: 10.1021/jm2010767
BindingDB Entry DOI: 10.7270/Q2G73FV3
ALK tyrosine kinase receptor
(Homo sapiens (Human))
BDBM50393615
(CHEMBL2158526)
Show SMILES COc1cc(ccc1Nc1ncc2ccc(-c3ccccc3N(C)S(C)(=O)=O)n2n1)C1CCN(C[C@@H](C)O)CC1 |r|
Show InChI InChI=1S/C29H36N6O4S/c1-20(36)19-34-15-13-21(14-16-34)22-9-11-25(28(17-22)39-3)31-29-30-18-23-10-12-27(35(23)32-29)24-7-5-6-8-26(24)33(2)40(4,37)38/h5-12,17-18,20-21,36H,13-16,19H2,1-4H3,(H,31,32)/t20-/m1/s1
n/an/a 6n/an/an/an/an/an/a
Cephalon, Inc.
Curated by ChEMBL
Assay Description
Inhibition of GST-tagged human ALK cytoplasmic domain (1058-1620) expressed in Sf21 insect cells using GST-tagged human recombinant PLC-gamma/substra...
J Med Chem 55: 115-25 (2012)
Article DOI: 10.1021/jm2010767
BindingDB Entry DOI: 10.7270/Q2G73FV3